{"text_format":"1","workbook":"xlsx","n_sheets":10,"sheets":["Setup","DrawPrep","Draw","PrgPrep","R1","R2","R3, R4, R5","notes","tmp","tmpRankings"],"not_rendered":{"charts":0,"images":0,"macros":1,"external_links":0,"defined_names":6,"comments":0,"pivot_tables":0},"unopened":[],"bounds":{"document_bytes":16777216,"sheet_cells":100000,"rows_first":2000,"rows_last":500,"rows_between":2000,"halvings":0,"cell_chars":16384,"cell_head_chars":4096},"cells_cut":0,"cells_raw":0,"read":"whole","date_system":"1900"}

{"sheet":"Setup","index":0,"n_rows":65,"n_cols":14,"rows_kept":65,"cut":false,"hidden":false,"merged":[[1,3,2,3],[4,3,7,3],[9,3,12,3],[14,3,17,3],[0,0,0,1]]}
["64άρι ταμπλό",null,null,"Θέσεις","seed",null,null,0,"seed","space pos","Index","Value",null,"0 0 0 0 0 0 0 0 0 0 0 0 0 0 0 0 0 0 0 0 0 0 0 0 0 0 0 0 0 0 0 0 0 0 0 0 0 0 0 0 0 0 1 2 3 4 5 6 7 8 9 10 11 12 13 14 15 16 19 20 21 18 22 17 "]
[null,null,null,"3-4",{"$f":"VALUE(LEFT(F2,1))","v":3},"3 4",null,{"$f":"IF(I2=\"-\",\"-\",IF(I2>0,H1+1,0))","v":0},{"$f":"IF(J2>0,VALUE(MID($N$1,1,J2-1)),\"-\")","v":0},{"$f":"IF(LEN($N$1)>1,FIND(\" \",$N$1,1),0)","v":2},0,0,null,"1 2 3 4 5 6 7 8 9 10 11 12 13 14 15 16 "]
["Διοργανωτής: ","ΕΦΟΑ",null,null,{"$f":"VALUE(RIGHT(F2,1))","v":4},null,null,{"$f":"IF(I3=\"-\",\"-\",IF(I3>0,H2+1,0))","v":0},{"$f":"IF(J3>0,VALUE(MID($N$1,J2+1,J3-J2-1)),\"-\")","v":0},{"$f":"IF(AND(J2>0,LEN($N$1)>J2+1),FIND(\" \",$N$1,J2+1),0)","v":4},0,0,null,"0 0 0 0 0 0 0 0 0 0 0 0 0 0 0 0 0 0 0 0 0 0 0 0 0 0 0 0 0 0 0 0 0 0 0 0 0 0 0 0 0 0 0 0 0 0 0 0 0 0 0 0 0 0 0 0 0 0 0 0 0 0 0 0  "]
["Τίτλος Τουρνουά: ","ΠΑΝΕΛΛΑΔΙΚΟ U10",null,"Θέσεις","seed",null,null,{"$f":"IF(I4>0,H3+1,0)","v":0},0,6,0,0]
["type: ","u10",null,"5-8",{"$f":"TRIM(LEFT(F5,(FIND(\" \",F5,1)-1)))","v":"7"},"7 5 8 6",null,0,0,8,0,0]
["Έδρα αγώνων: ","ΑΕΤ ΝΙΚΗ ΠΑΤΡΩΝ",null,null,{"$f":"TRIM(MID(F5,(FIND(\" \",F5,1)),FIND(\" \",F5,(FIND(\" \",F5,1)+1))-(FIND(\" \",F5,1))))","v":"5"},null,null,0,0,10,0,0]
["Κατηγορία: ","A-A C",null,null,{"$f":"TRIM(MID(F5, (FIND(\" \",F5,(FIND(\" \",F5,1)+1))+1), (FIND(\" \",F5,(FIND(\" \",F5,(FIND(\" \",F5,1)+1))+1)))-(FIND(\" \",F5,(FIND(\" \",F5,1)+1))+1)))","v":"8"},null,null,0,0,12,0,0]
["Έναρξη: ","24",null,null,{"$f":"TRIM(RIGHT(F5,LEN(F5)-(FIND(\" \",F5,(FIND(\" \",F5,(FIND(\" \",F5,1)+1))+1)))))","v":"6"},null,null,0,0,14,0,0]
["Λήξη: ","25 OKT 2015",null,"Θέσεις","seed",null,null,0,{"$f":"IF(J9>0,VALUE(MID($N$1,J8+1,J9-J8-1)),\"-\")","v":0},16,0,0]
["Επιδιατητής: ","Στέφος Αλέξης",null,"9-12",{"$f":"TRIM(LEFT(F10,(FIND(\" \",F10,1)-1)))","v":"12"},"12 11 10 9",null,0,0,18,0,0]
["Τηλέφωνο επιδ: ",2610642100,null,null,{"$f":"TRIM(MID(F10,(FIND(\" \",F10,1)),FIND(\" \",F10,(FIND(\" \",F10,1)+1))-(FIND(\" \",F10,1))))","v":"11"},null,null,0,0,20,0,0]
[null,null,null,null,{"$f":"TRIM(MID(F10, (FIND(\" \",F10,(FIND(\" \",F10,1)+1))+1), (FIND(\" \",F10,(FIND(\" \",F10,(FIND(\" \",F10,1)+1))+1)))-(FIND(\" \",F10,(FIND(\" \",F10,1)+1))+1)))","v":"10"},null,null,0,0,22,0,0]
[null,null,null,null,{"$f":"TRIM(RIGHT(F10,LEN(F10)-(FIND(\" \",F10,(FIND(\" \",F10,(FIND(\" \",F10,1)+1))+1)))))","v":"9"},null,null,0,0,24,0,0]
[null,null,null,"Θέσεις","seed",null,null,0,0,26,0,0]
[null,null,null,"13-16",{"$f":"TRIM(LEFT(F15,(FIND(\" \",F15,1)-1)))","v":"13"},"13 15 16 14",null,0,0,28,0,0]
[null,null,null,null,{"$f":"TRIM(MID(F15,(FIND(\" \",F15,1)),FIND(\" \",F15,(FIND(\" \",F15,1)+1))-(FIND(\" \",F15,1))))","v":"15"},null,null,0,{"$f":"IF(J16>0,VALUE(MID($N$1,J15+1,J16-J15-1)),\"-\")","v":0},30,0,0]
["Main Draw",{"$f":"\"(\"&COUNTBLANK(DrawPrep!D3:D66)&\")\"","v":"(42)"},null,null,{"$f":"TRIM(MID(F15, (FIND(\" \",F15,(FIND(\" \",F15,1)+1))+1), (FIND(\" \",F15,(FIND(\" \",F15,(FIND(\" \",F15,1)+1))+1)))-(FIND(\" \",F15,(FIND(\" \",F15,1)+1))+1)))","v":"16"},null,null,0,{"$f":"IF(J17>0,VALUE(MID($N$1,J16+1,J17-J16-1)),\"-\")","v":0},32,0,0]
["Πλήθος bye (0-31): ",{"$f":"COUNTBLANK(DrawPrep!D3:D66)","v":42},null,null,{"$f":"TRIM(RIGHT(F15,LEN(F15)-(FIND(\" \",F15,(FIND(\" \",F15,(FIND(\" \",F15,1)+1))+1)))))","v":"14"},null,null,0,{"$f":"IF(J18>0,VALUE(MID($N$1,J17+1,J18-J17-1)),\"-\")","v":0},34,0,0]
["Αριθμός θέσεων seeded: ",16,null,null,null,null,null,0,0,36,0,0]
[null,null,null,null,null,null,null,0,0,38,0,0]
[null,null,null,null,null,null,null,0,0,40,0,0]
[null,null,null,null,null,null,null,0,0,42,0,0]
[null,null,null,null,null,null,null,0,0,44,0,0]
["md  (# για off) ","ok",null,null,null,null,null,0,0,46,0,0]
[null,null,null,null,null,null,null,0,0,48,0,0]
["=RandUniq(3;4;2)",null,null,null,null,null,null,0,0,50,0,0]
["=RandUniq(5;8;4)",null,null,null,null,null,null,0,0,52,0,0]
["=RandUniq(9;12;4)",null,null,null,null,null,null,0,0,54,0,0]
["=RandUniq(13;16;4)",null,null,null,null,null,null,0,0,56,0,0]
[null,null,null,null,null,null,null,0,0,58,0,0]
["=CONCATENATE(LEFT($N$3;$B$18*2);IF($B$19<10;LEFT($N$2;$B$19*2);LEFT($N$2;$B$19*2+$B$19-10+1));RandUniq($B$19+1;64-$B$18;64-$B$19-$B$18);\" \")",null,null,null,null,null," ",0,0,60,0,0]
[null,null,null,null,null,null,null,0,0,62,0,0]
[null,null,null,null,null,null,null,0,0,64,0,0]
[null,null,null,null,null,null,null,0,0,66,0,0]
[null,null,null,null,null,null," ",0,0,68,0,0]
[null,null,null,null,null,null,null,0,0,70,0,0]
[null,null,null,null,null,null," ",0,0,72,0,0]
[null,null,null,null,null,null,null,0,0,74,0,0]
[null,null,null,null,null,null,null,0,0,76,0,0]
[null,null,null,null,null,null,null,0,0,78,0,0]
[null,null,null,null,null,null,null,0,0,80,0,0]
[null,null,null,null,null,null,null,0,0,82,0,0]
[null,null,null,null,null,null,null,0,0,84,0,0]
[null,null,null,null,null,null,null,1,1,86,1,1]
[null,null,null,null,null,null,null,2,2,88,2,2]
[null,null,null,null,null,null,null,3,3,90,3,3]
[null,null,null,null,null,null,null,4,4,92,4,4]
[null,null,null,null,null,null,null,5,5,94,5,5]
[null,null,null,null,null,null,null,6,6,96,6,6]
[null,null,null,null,null,null,null,7,7,{"$f":"IF(AND(J49>0,LEN($N$1)>J49+1),FIND(\" \",$N$1,J49+1),0)","v":98},7,7]
[null,null,null,null,null,null,null,8,8,100,8,8]
[null,null,null,null,null,null,null,9,9,102,9,9]
[null,null,null,null,null,null,null,10,10,105,10,10]
[null,null,null,null,null,null,null,11,11,108,11,11]
[null,null,null,null,null,null,null,12,12,111,12,12]
[null,null,null,null,null,null,null,13,13,114,13,13]
[null,null,null,null,null,null,null,14,14,117,14,14]
[null,null,null,null,null,null,null,15,15,120,15,15]
[null,null,null,null,null,null,null,16,16,123,16,16]
[null,null,null,null,null,null,null,17,19,126,17,19]
[null,null,null,null,null,null,null,18,20,129,18,20]
[null,null,null,null,null,null,null,19,21,132,19,21]
[null,null,null,null,null,null,null,20,18,135,20,18]
[null,null,null,null,null,null,null,21,22,138,21,22]
[null,null,null,null,null,null,null,22,17,141,22,17]

{"sheet":"DrawPrep","index":1,"n_rows":80,"n_cols":11,"rows_kept":80,"cut":false,"hidden":false,"merged":[[68,1,68,3]]}
[{"$f":"Setup!B3&\", \"&Setup!B4&\", \"&Setup!B6&\", \"&Setup!B8&\"-\"&Setup!B9","v":"ΕΦΟΑ, ΠΑΝΕΛΛΑΔΙΚΟ U10, ΑΕΤ ΝΙΚΗ ΠΑΤΡΩΝ, 24-25 OKT 2015"},null,null,null,null,null,null,{"$f":"Setup!B7","v":"A-A C"}]
["α/α","από","Α.Μ.","Ονοματεπώνυμο","Σύλλογος","βαθμοί","Τηλέφωνο","Υπογραφή","SortPts","Rnd","trim"]
[1,null,36587,"ΙΑΚΩΒΑΚΗΣ ΕΛΕΥΘΕΡΙΟΣ","Ο.Α. ΦΟΙΒΟΣ ΛΑΡΙΣΑΣ",23,null,null,{"$f":"IF(D3>\" \",IF(F3>=0,F3+tmp!C53,tmp!C53),0)","v":23.000290582207025},4.3967786258064532E-3,{"$f":"TRIM(D3)","v":"ΙΑΚΩΒΑΚΗΣ ΕΛΕΥΘΕΡΙΟΣ"}]
[2,null,36852,"ΤΖΩΡΤΖΑΤΟΣ ΚΩΝΣΤΑΝΤΙΝΟΣ","ΑΟΑ ΠΑΤΡΩΝ",22,null,null,{"$f":"IF(D4>\" \",IF(F4>=0,F4+tmp!C49,tmp!C49),0)","v":22.002821609449636},2.5694039943728155E-3,{"$f":"TRIM(D4)","v":"ΤΖΩΡΤΖΑΤΟΣ ΚΩΝΣΤΑΝΤΙΝΟΣ"}]
[3,null,33991,"ΛΑΜΠΡΟΠΟΥΛΟΣ ΜΙΧΑΛΗΣ","ΑΕΚ ΤΡΙΠΟΛΗΣ",21,null,null,{"$f":"IF(D5>\" \",IF(F5>=0,F5+tmp!C8,tmp!C8),0)","v":21.003680787802068},3.9029554214002051E-4,{"$f":"TRIM(D5)","v":"ΛΑΜΠΡΟΠΟΥΛΟΣ ΜΙΧΑΛΗΣ"}]
[4,null,40000,"ΓΟΥΔΕΛΗΣ ΔΗΜΗΤΡΗΣ","Α.Σ. ΑΣΤΕΡΑΣ ΠΕΝΤΕΛΙΚΟΥ",20,null,null,{"$f":"IF(D6>\" \",IF(F6>=0,F6+tmp!C34,tmp!C34),0)","v":20.002916478743014},4.3885891256489912E-3,{"$f":"TRIM(D6)","v":"ΓΟΥΔΕΛΗΣ ΔΗΜΗΤΡΗΣ"}]
[5,null,32434,"ΡΟΖΗΣ ΔΗΜΗΤΡΗΣ","Α.Ε.Τ. ΝΙΚΗ ΠΑΤΡΩΝ",19,null,null,{"$f":"IF(D7>\" \",IF(F7>=0,F7+tmp!C43,tmp!C43),0)","v":19.004443441395171},3.6807878020697861E-3,{"$f":"TRIM(D7)","v":"ΡΟΖΗΣ ΔΗΜΗΤΡΗΣ"}]
[6,null,37981,"ΓΙΑΝΝΟΣ ΗΛΙΑΣ","Α.Γ.Ο. ΦΙΛΙΠΠΙΑΔΑΣ",18,null,null,{"$f":"IF(D8>\" \",IF(F8>=0,F8+tmp!C37,tmp!C37),0)","v":18.002722648385031},7.4189261991627474E-4,{"$f":"TRIM(D8)","v":"ΓΙΑΝΝΟΣ ΗΛΙΑΣ"}]
[7,null,37444,"ΝΙΚΟΛΑΟΥ ΑΓΓΕΛΟΣ","Α.Ε.Τ. ΝΙΚΗ ΠΑΤΡΩΝ",17,null,null,{"$f":"IF(D9>\" \",IF(F9>=0,F9+tmp!C33,tmp!C33),0)","v":17.003637901809938},3.1462746246709652E-3,{"$f":"TRIM(D9)","v":"ΝΙΚΟΛΑΟΥ ΑΓΓΕΛΟΣ"}]
[8,null,37478,"ΚΑΡΑΟΥΛΑΝΗΣ ΒΑΣΙΛΕΙΟΣ","Ο.Α. ΦΟΙΒΟΣ ΛΑΡΙΣΑΣ",16,null,null,{"$f":"IF(D10>\" \",IF(F10>=0,F10+tmp!C28,tmp!C28),0)","v":16.001597812771617},1.301747214556438E-3,{"$f":"TRIM(D10)","v":"ΚΑΡΑΟΥΛΑΝΗΣ ΒΑΣΙΛΕΙΟΣ"}]
[9,null,37979,"ΧΑΤΖΟΠΟΥΛΟΣ ΒΑΣΙΛΕΙΟΣ","Α.Γ.Ο. ΦΙΛΙΠΠΙΑΔΑΣ",15,null,null,{"$f":"IF(D11>\" \",IF(F11>=0,F11+tmp!C22,tmp!C22),0)","v":15.004396778625807},3.716204021374256E-3,{"$f":"TRIM(D11)","v":"ΧΑΤΖΟΠΟΥΛΟΣ ΒΑΣΙΛΕΙΟΣ"}]
[10,null,33122,"ΑΦΑΛΩΝΙΑΤΗΣ ΘΑΝΟΣ","Α.Ε.Τ. ΝΙΚΗ ΠΑΤΡΩΝ",14,null,null,{"$f":"IF(D12>\" \",IF(F12>=0,F12+tmp!C51,tmp!C51),0)","v":14.000588113418509},3.5037585997559169E-3,{"$f":"TRIM(D12)","v":"ΑΦΑΛΩΝΙΑΤΗΣ ΘΑΝΟΣ"}]
[11,null,37434,"ΚΑΤΑΠΟΔΗΣ ΓΙΩΡΓΟΣ","ΑΟΑ ΠΑΤΡΩΝ",13,null,null,{"$f":"IF(D13>\" \",IF(F13>=0,F13+tmp!C27,tmp!C27),0)","v":13.000268777264091},4.3908889756680454E-3,{"$f":"TRIM(D13)","v":"ΚΑΤΑΠΟΔΗΣ ΓΙΩΡΓΟΣ"}]
[12,null,60000,"ΜΟΣΧΟΒΙΝΟΣ ΑΛΕΞΙΟΣ","Α.Σ. ΑΣΤΕΡΑΣ ΠΕΝΤΕΛΙΚΟΥ",12,null,null,{"$f":"IF(D14>\" \",IF(F14>=0,F14+tmp!C24,tmp!C24),0)","v":12.000158965872355},1.0242326640316163E-3,{"$f":"TRIM(D14)","v":"ΜΟΣΧΟΒΙΝΟΣ ΑΛΕΞΙΟΣ"}]
[13,null,33992,"ΛΑΜΠΡΟΠΟΥΛΟΣ ΑΓΓΕΛΟΣ","ΑΕΚ ΤΡΙΠΟΛΗΣ",11,null,null,{"$f":"IF(D15>\" \",IF(F15>=0,F15+tmp!C40,tmp!C40),0)","v":11.004031712655209},3.4037156641968259E-3,{"$f":"TRIM(D15)","v":"ΛΑΜΠΡΟΠΟΥΛΟΣ ΑΓΓΕΛΟΣ"}]
[14,null,32430,"ΔΗΜΟΠΟΥΛΟΣ ΝΙΚΟΛΑΣ","Α.Ε.Τ. ΝΙΚΗ ΠΑΤΡΩΝ",10,null,null,{"$f":"IF(D16>\" \",IF(F16>=0,F16+tmp!C44,tmp!C44),0)","v":10.004408889079812},3.1258977041393348E-3,{"$f":"TRIM(D16)","v":"ΔΗΜΟΠΟΥΛΟΣ ΝΙΚΟΛΑΣ"}]
[15,null,35978,"ΔΗΜΗΤΡΙΟΥ ΓΙΩΡΓΟΣ","ΑΟΑ ΠΑΠΑΓΟΥ",null,null,null,{"$f":"IF(D17>\" \",IF(F17>=0,F17+tmp!C35,tmp!C35),0)","v":4.4712770907442342E-3},2.235346199736784E-3,{"$f":"TRIM(D17)","v":"ΔΗΜΗΤΡΙΟΥ ΓΙΩΡΓΟΣ"}]
[16,null,37664,"ΚΑΥΜΕΝΑΚΗΣ ΑΡΙΣΤΟΤΕΛΗΣ","Ο.Α. ΧΑΝΙΩΝ",null,null,null,{"$f":"IF(D18>\" \",IF(F18>=0,F18+tmp!C11,tmp!C11),0)","v":4.3885891256489912E-3},1.2614256019235443E-3,{"$f":"TRIM(D18)","v":"ΚΑΥΜΕΝΑΚΗΣ ΑΡΙΣΤΟΤΕΛΗΣ"}]
[17,null,34016,"ΜΠΟΝΙΚΟΣ ΣΠΥΡΟΣ","ΖΑΚΥΝΘΙΝΟΣ Α.Ο.Α.",null,null,null,{"$f":"IF(D19>\" \",IF(F19>=0,F19+tmp!C12,tmp!C12),0)","v":3.4037156641968259E-3},1.1458248008327835E-3,{"$f":"TRIM(D19)","v":"ΜΠΟΝΙΚΟΣ ΣΠΥΡΟΣ"}]
[18,null,37253,"ΓΙΑΝΝΑΚΟΠΟΥΛΟΣ ΔΙΟΝΥΣΙΟΣ","Α. Σ. ΚΟΛΛΕΓΙΟΥ ΝΤΕΡΗ",null,null,null,{"$f":"IF(D20>\" \",IF(F20>=0,F20+tmp!C7,tmp!C7),0)","v":3.1462746246709652E-3},5.2569749377454989E-4,{"$f":"TRIM(D20)","v":"ΓΙΑΝΝΑΚΟΠΟΥΛΟΣ ΔΙΟΝΥΣΙΟΣ"}]
[19,null,37254,"ΤΖΙΤΖΙΜΙΚΑΣ ΓΕΩΡΓΙΟΣ","Α.Ο. ΚΟΛΕΓΙΟΥ ΝΤΕΡΗ",null,null,null,{"$f":"IF(D21>\" \",IF(F21>=0,F21+tmp!C38,tmp!C38),0)","v":2.5761573680904283E-3},2.2311311084535052E-3,{"$f":"TRIM(D21)","v":"ΤΖΙΤΖΙΜΙΚΑΣ ΓΕΩΡΓΙΟΣ"}]
[20,null,31968,"ΨΑΡΑΚΗΣ ΓΙΑΝΝΗΣ","ΚΙΑΤΟ",null,null,null,{"$f":"IF(D22>\" \",IF(F22>=0,F22+tmp!C46,tmp!C46),0)","v":1.6457757571571672E-3},1.1876593002907952E-3,{"$f":"TRIM(D22)","v":"ΨΑΡΑΚΗΣ ΓΙΑΝΝΗΣ"}]
[21,null,35560,"ΔΑΝΙΗΛΟΓΛΟΥ ΓΙΩΡΓΟΣ","Ο.Α. ΓΟΥΔΗ",null,null,null,{"$f":"IF(D23>\" \",IF(F23>=0,F23+tmp!C10,tmp!C10),0)","v":1.0242326640316163E-3},2.0694973391932421E-3,{"$f":"TRIM(D23)","v":"ΔΑΝΙΗΛΟΓΛΟΥ ΓΙΩΡΓΟΣ"}]
[22,null,34921,"ΜΕΓΑΛΟΓΙΑΝΝΗΣ ΚΩΝΣΤΑΝΤΙΝΟΣ","ΑΙΟΛΟΣ ΑΘΛ. ΛΕΣΧΗ ΙΛΙΟΥ",null,null,null,{"$f":"IF(D24>\" \",IF(F24>=0,F24+tmp!C32,tmp!C32),0)","v":6.5184873855006085E-4},3.8677240688477161E-3,{"$f":"TRIM(D24)","v":"ΜΕΓΑΛΟΓΙΑΝΝΗΣ ΚΩΝΣΤΑΝΤΙΝΟΣ"}]
[23,null,null,"",null,null,null,null,{"$f":"IF(D25>\" \",IF(F25>=0,F25+tmp!C13,tmp!C13),0)","v":0},1.5896587235462789E-4,{"$f":"TRIM(D25)","v":""}]
[24,null,null,"",null,null,null,null,{"$f":"IF(D26>\" \",IF(F26>=0,F26+tmp!C5,tmp!C5),0)","v":0},2.4764714784467805E-3,{"$f":"TRIM(D26)","v":""}]
[25,null,null,"",null,null,null,null,{"$f":"IF(D27>\" \",IF(F27>=0,F27+tmp!C50,tmp!C50),0)","v":0},2.2656564701454005E-3,{"$f":"TRIM(D27)","v":""}]
[26,null,null,"",null,null,null,null,{"$f":"IF(D28>\" \",IF(F28>=0,F28+tmp!C25,tmp!C25),0)","v":0},2.6877726409101662E-4,{"$f":"TRIM(D28)","v":""}]
[27,null,null,"",null,null,null,null,{"$f":"IF(D29>\" \",IF(F29>=0,F29+tmp!C47,tmp!C47),0)","v":0},1.5978127716171258E-3,{"$f":"TRIM(D29)","v":""}]
[28,null,null,"",null,null,null,null,{"$f":"IF(D30>\" \",IF(F30>=0,F30+tmp!C4,tmp!C4),0)","v":0},1.7633291024635744E-3,{"$f":"TRIM(D30)","v":""}]
[29,null,null,"",null,null,null,null,{"$f":"IF(D31>\" \",IF(F31>=0,F31+tmp!C45,tmp!C45),0)","v":0},8.4006340154300951E-4,{"$f":"TRIM(D31)","v":""}]
[30,null,null,"",null,null,null,null,{"$f":"IF(D32>\" \",IF(F32>=0,F32+tmp!C16,tmp!C16),0)","v":0},2.2793293203560599E-3,{"$f":"TRIM(D32)","v":""}]
[31,null,null,"",null,null,null,null,{"$f":"IF(D33>\" \",IF(F33>=0,F33+tmp!C18,tmp!C18),0)","v":0},6.5184873855006085E-4,{"$f":"TRIM(D33)","v":""}]
[32,null,null,"",null,null,null,null,{"$f":"IF(D34>\" \",IF(F34>=0,F34+tmp!C20,tmp!C20),0)","v":0},3.6379018099392361E-3,{"$f":"TRIM(D34)","v":""}]
[33,null,null,"",null,null,null,null,{"$f":"IF(D35>\" \",IF(F35>=0,F35+tmp!C15,tmp!C15),0)","v":0},2.9164787430153295E-3,{"$f":"TRIM(D35)","v":""}]
[34,null,null,"",null,null,null,null,{"$f":"IF(D36>\" \",IF(F36>=0,F36+tmp!C19,tmp!C19),0)","v":0},4.4712770907442342E-3,{"$f":"TRIM(D36)","v":""}]
[35,null,null,"",null,null,null,null,{"$f":"IF(D37>\" \",IF(F37>=0,F37+tmp!C48,tmp!C48),0)","v":0},4.1396393306734752E-3,{"$f":"TRIM(D37)","v":""}]
[36,null,null,"",null,null,null,null,{"$f":"IF(D38>\" \",IF(F38>=0,F38+tmp!C39,tmp!C39),0)","v":0},2.7226483850307424E-3,{"$f":"TRIM(D38)","v":""}]
[37,null,null,"",null,null,null,null,{"$f":"IF(D39>\" \",IF(F39>=0,F39+tmp!C17,tmp!C17),0)","v":0},2.5761573680904283E-3,{"$f":"TRIM(D39)","v":""}]
[38,null,null,"",null,null,null,null,{"$f":"IF(D40>\" \",IF(F40>=0,F40+tmp!C3,tmp!C3),0)","v":0},3.6493517349492199E-3,{"$f":"TRIM(D40)","v":""}]
[39,null,null,"",null,null,null,null,{"$f":"IF(D41>\" \",IF(F41>=0,F41+tmp!C36,tmp!C36),0)","v":0},4.0317126552084949E-3,{"$f":"TRIM(D41)","v":""}]
[40,null,null,"",null,null,null,null,{"$f":"IF(D42>\" \",IF(F42>=0,F42+tmp!C21,tmp!C21),0)","v":0},6.5477300338301044E-4,{"$f":"TRIM(D42)","v":""}]
[41,null,null,"",null,null,null,null,{"$f":"IF(D43>\" \",IF(F43>=0,F43+tmp!C2,tmp!C2),0)","v":0},7.9328437902715418E-4,{"$f":"TRIM(D43)","v":""}]
[42,null,null,"",null,null,null,null,{"$f":"IF(D44>\" \",IF(F44>=0,F44+tmp!C29,tmp!C29),0)","v":0},4.4434413951728157E-3,{"$f":"TRIM(D44)","v":""}]
[43,null,null,"",null,null,null,null,{"$f":"IF(D45>\" \",IF(F45>=0,F45+tmp!C52,tmp!C52),0)","v":0},4.4088890798114561E-3,{"$f":"TRIM(D45)","v":""}]
[44,null,null,"",null,null,null,null,{"$f":"IF(D46>\" \",IF(F46>=0,F46+tmp!C41,tmp!C41),0)","v":0},3.949713174562517E-4,{"$f":"TRIM(D46)","v":""}]
[45,null,null,"",null,null,null,null,{"$f":"IF(D47>\" \",IF(F47>=0,F47+tmp!C23,tmp!C23),0)","v":0},1.6457757571571672E-3,{"$f":"TRIM(D47)","v":""}]
[46,null,null,"",null,null,null,null,{"$f":"IF(D48>\" \",IF(F48>=0,F48+tmp!C42,tmp!C42),0)","v":0},4.3893548001563724E-3,{"$f":"TRIM(D48)","v":""}]
[47,null,null,"",null,null,null,null,{"$f":"IF(D49>\" \",IF(F49>=0,F49+tmp!C9,tmp!C9),0)","v":0},3.6021504289067397E-3,{"$f":"TRIM(D49)","v":""}]
[48,null,null,"",null,null,null,null,{"$f":"IF(D50>\" \",IF(F50>=0,F50+tmp!C26,tmp!C26),0)","v":0},2.8216094496348429E-3,{"$f":"TRIM(D50)","v":""}]
[49,null,null,"",null,null,null,null,{"$f":"IF(D51>\" \",IF(F51>=0,F51+tmp!C31,tmp!C31),0)","v":0},9.9201923332780311E-5,{"$f":"TRIM(D51)","v":""}]
[50,null,null,"",null,null,null,null,{"$f":"IF(D52>\" \",IF(F52>=0,F52+tmp!C30,tmp!C30),0)","v":0},5.8811341850842488E-4,{"$f":"TRIM(D52)","v":""}]
[51,null,null,"",null,null,null,null,{"$f":"IF(D53>\" \",IF(F53>=0,F53+tmp!C6,tmp!C6),0)","v":0},2.9966215482674116E-3,{"$f":"TRIM(D53)","v":""}]
[52,null,null,"",null,null,null,null,{"$f":"IF(D54>\" \",IF(F54>=0,F54+tmp!C14,tmp!C14),0)","v":0},2.9058220702485142E-4,{"$f":"TRIM(D54)","v":""}]
[53,null,null,"",null,null,null,null,{"$f":"IF(D55>\" \",IF(F55>=0,F55+tmp!C54,tmp!C54),0)","v":0},2.0615806761918316E-3,{"$f":"TRIM(D55)","v":""}]
[54,null,null,"",null,null,null,null,{"$f":"IF(D56>\" \",IF(F56>=0,F56+tmp!C56,tmp!C56),0)","v":0},9.1664440631633091E-5,{"$f":"TRIM(D56)","v":""}]
[55,null,null,"",null,null,null,null,{"$f":"IF(D57>\" \",IF(F57>=0,F57+tmp!C55,tmp!C55),0)","v":0},4.4354318993836319E-3,{"$f":"TRIM(D57)","v":""}]
[56,null,null,"",null,null,null,null,{"$f":"IF(D58>\" \",IF(F58>=0,F58+tmp!C57,tmp!C57),0)","v":0},3.7189689512944575E-4,{"$f":"TRIM(D58)","v":""}]
[57,null,null,"",null,null,null,null,{"$f":"IF(D59>\" \",IF(F59>=0,F59+tmp!C58,tmp!C58),0)","v":0},2.0498483417336747E-3,{"$f":"TRIM(D59)","v":""}]
[58,null,null,"",null,null,null,null,{"$f":"IF(D60>\" \",IF(F60>=0,F60+tmp!C59,tmp!C59),0)","v":0},3.1428197043800905E-3,{"$f":"TRIM(D60)","v":""}]
[59,null,null,"",null,null,null,null,{"$f":"IF(D61>\" \",IF(F61>=0,F61+tmp!C60,tmp!C60),0)","v":0},2.4344333702733009E-3,{"$f":"TRIM(D61)","v":""}]
[60,null,null,"",null,null,null,null,{"$f":"IF(D62>\" \",IF(F62>=0,F62+tmp!C61,tmp!C61),0)","v":0},2.1222357728358757E-3,{"$f":"TRIM(D62)","v":""}]
[61,null,null,"",null,null,null,null,{"$f":"IF(D63>\" \",IF(F63>=0,F63+tmp!C62,tmp!C62),0)","v":0},2.6071459720036238E-3,{"$f":"TRIM(D63)","v":""}]
[62,null,null,"",null,null,null,null,{"$f":"IF(D64>\" \",IF(F64>=0,F64+tmp!C63,tmp!C63),0)","v":0},2.5020093650881545E-3,{"$f":"TRIM(D64)","v":""}]
[63,null,null,"",null,null,null,null,{"$f":"IF(D65>\" \",IF(F65>=0,F65+tmp!C64,tmp!C64),0)","v":0},2.1322137455800382E-3,{"$f":"TRIM(D65)","v":""}]
[64,null,null,"",null,null,null,null,{"$f":"IF(D66>\" \",IF(F66>=0,F66+tmp!C65,tmp!C65),0)","v":0},4.319046889309377E-3,{"$f":"TRIM(D66)","v":""}]
[]
[]
[null,"Walk over",null,null,"med"]
[null,"α/α","Α.Μ.","Ονοματεπώνυμο","Ν ή Ο",null,null,{"$f":"Setup!$B$10","v":"Στέφος Αλέξης"}]
[null,1]
[null,2]
[null,3]
[null,4]
[null,5]
[null,6]
[null,7]
[null,8]
[null,9]
[null,10]

{"sheet":"Draw","index":2,"n_rows":106,"n_cols":21,"rows_kept":106,"cut":false,"hidden":false,"merged":[[69,15,69,16],[2,9,2,11],[0,0,0,17]]}
[{"$f":"Setup!B3&\", \"&Setup!B4&\", \"&Setup!B6&\", \"&Setup!B8&\"-\"&Setup!B9","v":"ΕΦΟΑ, ΠΑΝΕΛΛΑΔΙΚΟ U10, ΑΕΤ ΝΙΚΗ ΠΑΤΡΩΝ, 24-25 OKT 2015"},null,null,null,null,null,null,null,null,null,null,null,null,null,null,null,null,null,null,{"$f":"Setup!B7","v":"A-A C"}]
[null,{"$f":"Setup!B18","v":42},null,null,null,null,null,null,"p1",null,null,null,null,"p2",null,"p3",null,"p4",null,"p5-6"]
[null,null,null,null,null,null,null,null,null,64,null,null,null,32,null,16,null,8,null,"4 & 2"]
["α/α",null,"ByeOrder","ByeSum","ByeCnt","από","seed","Pts","Α.Μ.","Ονοματεπώνυμο","επώνυμο","Σύλλογος"]
[1,1,null,null,0,{"$f":"IF(NOT($G5=\"-\"),VLOOKUP($G5,DrawPrep!$A$3:$F$66,2,FALSE),\"\")","v":0},{"$f":"VLOOKUP($B5,Setup!$K$2:$L$65,2,FALSE)","v":1},{"$f":"IF($G5>0,VLOOKUP($G5,DrawPrep!$A$3:$F$66,6,FALSE),0)","v":23},{"$f":"IF(Setup!$B$24=\"#\",0,IF($G5>0,VLOOKUP($G5,DrawPrep!$A$3:$F$66,3,FALSE),0))","v":36587},{"$f":"IF($I5>0,VLOOKUP($I5,DrawPrep!$C$3:$F$66,2,FALSE),\"bye\")","v":"ΙΑΚΩΒΑΚΗΣ ΕΛΕΥΘΕΡΙΟΣ"},{"$f":"IF(NOT(I5>0),\"\", IF(ISERROR(FIND(\"-\",J5)), LEFT(J5,FIND(\" \",J5)-1), IF(FIND(\"-\",J5)>FIND(\" \",J5),LEFT(J5,FIND(\" \",J5)-1), LEFT(J5,FIND(\"-\",J5)-1) )))","v":"ΙΑΚΩΒΑΚΗΣ"},{"$f":"IF($I5>0,VLOOKUP($I5,DrawPrep!$C$3:$F$66,3,FALSE),\"\")","v":"Ο.Α. ΦΟΙΒΟΣ ΛΑΡΙΣΑΣ"},null,{"$f":"UPPER(IF($A$2=\"R\",IF(OR(M5=1,M5=\"a\"),I5,IF(OR(M5=2,M5=\"b\"),I6,\"\")),IF(OR(M5=1,M5=\"1\"),K5,IF(OR(M5=2,M5=\"b\"),K6,\"\"))))","v":""}]
[2,{"$f":"1-D6+16","v":16},{"$f":"B5","v":1},{"$f":"E6","v":1},{"$f":"IF($B$2>=C6,1,0)","v":1},{"$f":"IF(NOT($G6=\"-\"),VLOOKUP($G6,DrawPrep!$A$3:$F$66,2,FALSE),\"\")","v":""},{"$f":"IF($B$2>=C6,\"-\",VLOOKUP($B6,Setup!$K$2:$L$65,2,FALSE))","v":"-"},{"$f":"IF(NOT($G6=\"-\"),VLOOKUP($G6,DrawPrep!$A$3:$F$66,6,FALSE),0)","v":0},{"$f":"IF(Setup!$B$24=\"#\",0,IF(NOT($G6=\"-\"),VLOOKUP($G6,DrawPrep!$A$3:$F$66,3,FALSE),0))","v":0},{"$f":"IF($I6>0,VLOOKUP($I6,DrawPrep!$C$3:$F$66,2,FALSE),\"bye\")","v":"bye"},{"$f":"IF(NOT(I6>0),\"\", IF(ISERROR(FIND(\"-\",J6)), LEFT(J6,FIND(\" \",J6)-1), IF(FIND(\"-\",J6)>FIND(\" \",J6),LEFT(J6,FIND(\" \",J6)-1), LEFT(J6,FIND(\"-\",J6)-1) )))","v":""},{"$f":"IF($I6>0,VLOOKUP($I6,DrawPrep!$C$3:$F$66,3,FALSE),\"\")","v":""},null,null,null,{"$f":"UPPER(IF($A$2=\"R\",IF(OR(O6=1,O6=\"a\"),N5,IF(OR(O6=2,O6=\"b\"),N7,\"\")),IF(OR(O6=1,O6=\"a\"),N5,IF(OR(O6=2,O6=\"b\"),N7,\"\"))))","v":""}]
[3,{"$f":"2-D7+16","v":17},null,{"$f":"D6+E7","v":1},0,{"$f":"IF(NOT($G7=\"-\"),VLOOKUP($G7,DrawPrep!$A$3:$F$66,2,FALSE),\"\")","v":0},{"$f":"VLOOKUP($B7,Setup!$K$2:$L$65,2,FALSE)","v":19},{"$f":"IF($G7>0,VLOOKUP($G7,DrawPrep!$A$3:$F$66,6,FALSE),0)","v":0},{"$f":"IF(Setup!$B$24=\"#\",0,IF($G7>0,VLOOKUP($G7,DrawPrep!$A$3:$F$66,3,FALSE),0))","v":37254},{"$f":"IF($I7>0,VLOOKUP($I7,DrawPrep!$C$3:$F$66,2,FALSE),\"bye\")","v":"ΤΖΙΤΖΙΜΙΚΑΣ ΓΕΩΡΓΙΟΣ"},"ΤΖΙΤΖΙΜΙΚΑΣ",{"$f":"IF($I7>0,VLOOKUP($I7,DrawPrep!$C$3:$F$66,3,FALSE),\"\")","v":"Α.Ο. ΚΟΛΕΓΙΟΥ ΝΤΕΡΗ"},null,{"$f":"UPPER(IF($A$2=\"R\",IF(OR(M7=1,M7=\"a\"),I7,IF(OR(M7=2,M7=\"b\"),I8,\"\")),IF(OR(M7=1,M7=\"a\"),K7,IF(OR(M7=2,M7=\"b\"),K8,\"\"))))","v":""}]
[4,{"$f":"3-D8+16","v":17},29,{"$f":"D7+E8","v":2},{"$f":"IF($B$2>=C8,1,0)","v":1},{"$f":"IF(NOT($G8=\"-\"),VLOOKUP($G8,DrawPrep!$A$3:$F$66,2,FALSE),\"\")","v":""},{"$f":"IF($B$2>=C8,\"-\",VLOOKUP($B8,Setup!$K$2:$L$65,2,FALSE))","v":"-"},{"$f":"IF(NOT($G8=\"-\"),VLOOKUP($G8,DrawPrep!$A$3:$F$66,6,FALSE),0)","v":0},{"$f":"IF(Setup!$B$24=\"#\",0,IF(NOT($G8=\"-\"),VLOOKUP($G8,DrawPrep!$A$3:$F$66,3,FALSE),0))","v":0},{"$f":"IF($I8>0,VLOOKUP($I8,DrawPrep!$C$3:$F$66,2,FALSE),\"bye\")","v":"bye"},"",{"$f":"IF($I8>0,VLOOKUP($I8,DrawPrep!$C$3:$F$66,3,FALSE),\"\")","v":""},null,null,null,null,null,{"$f":"UPPER(IF($A$2=\"R\",IF(OR(Q8=1,Q8=\"a\"),P6,IF(OR(Q8=2,Q8=\"b\"),P10,\"\")),IF(OR(Q8=1,Q8=\"a\"),P6,IF(OR(Q8=2,Q8=\"b\"),P10,\"\"))))","v":""}]
[5,{"$f":"4-D9+16","v":18},null,2,0,{"$f":"IF(NOT($G9=\"-\"),VLOOKUP($G9,DrawPrep!$A$3:$F$66,2,FALSE),\"\")","v":0},{"$f":"VLOOKUP($B9,Setup!$K$2:$L$65,2,FALSE)","v":20},{"$f":"IF($G9>0,VLOOKUP($G9,DrawPrep!$A$3:$F$66,6,FALSE),0)","v":0},{"$f":"IF(Setup!$B$24=\"#\",0,IF($G9>0,VLOOKUP($G9,DrawPrep!$A$3:$F$66,3,FALSE),0))","v":31968},{"$f":"IF($I9>0,VLOOKUP($I9,DrawPrep!$C$3:$F$66,2,FALSE),\"bye\")","v":"ΨΑΡΑΚΗΣ ΓΙΑΝΝΗΣ"},"ΨΑΡΑΚΗΣ",{"$f":"IF($I9>0,VLOOKUP($I9,DrawPrep!$C$3:$F$66,3,FALSE),\"\")","v":"ΚΙΑΤΟ"},null,{"$f":"UPPER(IF($A$2=\"R\",IF(OR(M9=1,M9=\"a\"),I9,IF(OR(M9=2,M9=\"b\"),I10,\"\")),IF(OR(M9=1,M9=\"a\"),K9,IF(OR(M9=2,M9=\"b\"),K10,\"\"))))","v":""}]
[6,{"$f":"5-D10+16","v":18},17,3,{"$f":"IF($B$2>=C10,1,0)","v":1},{"$f":"IF(NOT($G10=\"-\"),VLOOKUP($G10,DrawPrep!$A$3:$F$66,2,FALSE),\"\")","v":""},{"$f":"IF($B$2>=C10,\"-\",VLOOKUP($B10,Setup!$K$2:$L$65,2,FALSE))","v":"-"},{"$f":"IF(NOT($G10=\"-\"),VLOOKUP($G10,DrawPrep!$A$3:$F$66,6,FALSE),0)","v":0},{"$f":"IF(Setup!$B$24=\"#\",0,IF(NOT($G10=\"-\"),VLOOKUP($G10,DrawPrep!$A$3:$F$66,3,FALSE),0))","v":0},{"$f":"IF($I10>0,VLOOKUP($I10,DrawPrep!$C$3:$F$66,2,FALSE),\"bye\")","v":"bye"},"",{"$f":"IF($I10>0,VLOOKUP($I10,DrawPrep!$C$3:$F$66,3,FALSE),\"\")","v":""},null,null,null,{"$f":"UPPER(IF($A$2=\"R\",IF(OR(O10=1,O10=\"a\"),N9,IF(OR(O10=2,O10=\"b\"),N11,\"\")),IF(OR(O10=1,O10=\"a\"),N9,IF(OR(O10=2,O10=\"b\"),N11,\"\"))))","v":""}]
[7,{"$f":"6-D11+16","v":18},{"$f":"B12","v":13},4,{"$f":"IF($B$2>=C11,1,0)","v":1},{"$f":"IF(NOT($G11=\"-\"),VLOOKUP($G11,DrawPrep!$A$3:$F$66,2,FALSE),\"\")","v":""},{"$f":"IF($B$2>=C11,\"-\",VLOOKUP($B11,Setup!$K$2:$L$65,2,FALSE))","v":"-"},{"$f":"IF(NOT($G11=\"-\"),VLOOKUP($G11,DrawPrep!$A$3:$F$66,6,FALSE),0)","v":0},{"$f":"IF(Setup!$B$24=\"#\",0,IF(NOT($G11=\"-\"),VLOOKUP($G11,DrawPrep!$A$3:$F$66,3,FALSE),0))","v":0},{"$f":"IF($I11>0,VLOOKUP($I11,DrawPrep!$C$3:$F$66,2,FALSE),\"bye\")","v":"bye"},"",{"$f":"IF($I11>0,VLOOKUP($I11,DrawPrep!$C$3:$F$66,3,FALSE),\"\")","v":""},null,{"$f":"UPPER(IF($A$2=\"R\",IF(OR(M11=1,M11=\"a\"),I11,IF(OR(M11=2,M11=\"b\"),I12,\"\")),IF(OR(M11=1,M11=\"a\"),K11,IF(OR(M11=2,M11=\"b\"),K12,\"\"))))","v":""}]
[8,{"$f":"VALUE(Setup!E15)","v":13},null,4,0,{"$f":"IF(NOT($G12=\"-\"),VLOOKUP($G12,DrawPrep!$A$3:$F$66,2,FALSE),\"\")","v":0},{"$f":"VLOOKUP($B12,Setup!$K$2:$L$65,2,FALSE)","v":13},{"$f":"IF($G12>0,VLOOKUP($G12,DrawPrep!$A$3:$F$66,6,FALSE),0)","v":11},{"$f":"IF(Setup!$B$24=\"#\",0,IF($G12>0,VLOOKUP($G12,DrawPrep!$A$3:$F$66,3,FALSE),0))","v":33992},{"$f":"IF($I12>0,VLOOKUP($I12,DrawPrep!$C$3:$F$66,2,FALSE),\"bye\")","v":"ΛΑΜΠΡΟΠΟΥΛΟΣ ΑΓΓΕΛΟΣ"},"ΛΑΜΠΡΟΠΟΥΛΟΣ",{"$f":"IF($I12>0,VLOOKUP($I12,DrawPrep!$C$3:$F$66,3,FALSE),\"\")","v":"ΑΕΚ ΤΡΙΠΟΛΗΣ"},null,null,null,null,null,null,null,{"$f":"UPPER(IF($A$2=\"R\",IF(OR(S12=1,S12=\"a\"),R8,IF(OR(S12=2,S12=\"b\"),R16,\"\")),IF(OR(S12=1,S12=\"a\"),R8,IF(OR(S12=2,S12=\"b\"),R16,\"\"))))","v":""}]
[9,{"$f":"VALUE(Setup!E10)","v":12},null,4,0,{"$f":"IF(NOT($G13=\"-\"),VLOOKUP($G13,DrawPrep!$A$3:$F$66,2,FALSE),\"\")","v":0},{"$f":"VLOOKUP($B13,Setup!$K$2:$L$65,2,FALSE)","v":12},{"$f":"IF($G13>0,VLOOKUP($G13,DrawPrep!$A$3:$F$66,6,FALSE),0)","v":12},{"$f":"IF(Setup!$B$24=\"#\",0,IF($G13>0,VLOOKUP($G13,DrawPrep!$A$3:$F$66,3,FALSE),0))","v":60000},{"$f":"IF($I13>0,VLOOKUP($I13,DrawPrep!$C$3:$F$66,2,FALSE),\"bye\")","v":"ΜΟΣΧΟΒΙΝΟΣ ΑΛΕΞΙΟΣ"},"ΜΟΣΧΟΒΙΝΟΣ",{"$f":"IF($I13>0,VLOOKUP($I13,DrawPrep!$C$3:$F$66,3,FALSE),\"\")","v":"Α.Σ. ΑΣΤΕΡΑΣ ΠΕΝΤΕΛΙΚΟΥ"},null,{"$f":"UPPER(IF($A$2=\"R\",IF(OR(M13=1,M13=\"a\"),I13,IF(OR(M13=2,M13=\"b\"),I14,\"\")),IF(OR(M13=1,M13=\"a\"),K13,IF(OR(M13=2,M13=\"b\"),K14,\"\"))))","v":""}]
[10,{"$f":"7-D14+16","v":18},{"$f":"B13","v":12},5,{"$f":"IF($B$2>=C14,1,0)","v":1},{"$f":"IF(NOT($G14=\"-\"),VLOOKUP($G14,DrawPrep!$A$3:$F$66,2,FALSE),\"\")","v":""},{"$f":"IF($B$2>=C14,\"-\",VLOOKUP($B14,Setup!$K$2:$L$65,2,FALSE))","v":"-"},{"$f":"IF(NOT($G14=\"-\"),VLOOKUP($G14,DrawPrep!$A$3:$F$66,6,FALSE),0)","v":0},{"$f":"IF(Setup!$B$24=\"#\",0,IF(NOT($G14=\"-\"),VLOOKUP($G14,DrawPrep!$A$3:$F$66,3,FALSE),0))","v":0},{"$f":"IF($I14>0,VLOOKUP($I14,DrawPrep!$C$3:$F$66,2,FALSE),\"bye\")","v":"bye"},"",{"$f":"IF($I14>0,VLOOKUP($I14,DrawPrep!$C$3:$F$66,3,FALSE),\"\")","v":""},null,null,null,{"$f":"UPPER(IF($A$2=\"R\",IF(OR(O14=1,O14=\"a\"),N13,IF(OR(O14=2,O14=\"b\"),N15,\"\")),IF(OR(O14=1,O14=\"a\"),N13,IF(OR(O14=2,O14=\"b\"),N15,\"\"))))","v":""}]
[11,{"$f":"8-D15+16","v":19},null,5,0,{"$f":"IF(NOT($G15=\"-\"),VLOOKUP($G15,DrawPrep!$A$3:$F$66,2,FALSE),\"\")","v":0},{"$f":"VLOOKUP($B15,Setup!$K$2:$L$65,2,FALSE)","v":21},{"$f":"IF($G15>0,VLOOKUP($G15,DrawPrep!$A$3:$F$66,6,FALSE),0)","v":0},{"$f":"IF(Setup!$B$24=\"#\",0,IF($G15>0,VLOOKUP($G15,DrawPrep!$A$3:$F$66,3,FALSE),0))","v":35560},{"$f":"IF($I15>0,VLOOKUP($I15,DrawPrep!$C$3:$F$66,2,FALSE),\"bye\")","v":"ΔΑΝΙΗΛΟΓΛΟΥ ΓΙΩΡΓΟΣ"},"ΔΑΝΙΗΛΟΓΛΟΥ",{"$f":"IF($I15>0,VLOOKUP($I15,DrawPrep!$C$3:$F$66,3,FALSE),\"\")","v":"Ο.Α. ΓΟΥΔΗ"},null,{"$f":"UPPER(IF($A$2=\"R\",IF(OR(M15=1,M15=\"a\"),I15,IF(OR(M15=2,M15=\"b\"),I16,\"\")),IF(OR(M15=1,M15=\"a\"),K15,IF(OR(M15=2,M15=\"b\"),K16,\"\"))))","v":""}]
[12,{"$f":"9-D16+16","v":19},25,6,{"$f":"IF($B$2>=C16,1,0)","v":1},{"$f":"IF(NOT($G16=\"-\"),VLOOKUP($G16,DrawPrep!$A$3:$F$66,2,FALSE),\"\")","v":""},{"$f":"IF($B$2>=C16,\"-\",VLOOKUP($B16,Setup!$K$2:$L$65,2,FALSE))","v":"-"},{"$f":"IF(NOT($G16=\"-\"),VLOOKUP($G16,DrawPrep!$A$3:$F$66,6,FALSE),0)","v":0},{"$f":"IF(Setup!$B$24=\"#\",0,IF(NOT($G16=\"-\"),VLOOKUP($G16,DrawPrep!$A$3:$F$66,3,FALSE),0))","v":0},{"$f":"IF($I16>0,VLOOKUP($I16,DrawPrep!$C$3:$F$66,2,FALSE),\"bye\")","v":"bye"},"",{"$f":"IF($I16>0,VLOOKUP($I16,DrawPrep!$C$3:$F$66,3,FALSE),\"\")","v":""},null,null,null,null,null,{"$f":"UPPER(IF($A$2=\"R\",IF(OR(Q16=1,Q16=\"a\"),P14,IF(OR(Q16=2,Q16=\"b\"),P18,\"\")),IF(OR(Q16=1,Q16=\"a\"),P14,IF(OR(Q16=2,Q16=\"b\"),P18,\"\"))))","v":""}]
[13,{"$f":"10-D17+16","v":20},null,6,0,{"$f":"IF(NOT($G17=\"-\"),VLOOKUP($G17,DrawPrep!$A$3:$F$66,2,FALSE),\"\")","v":0},{"$f":"VLOOKUP($B17,Setup!$K$2:$L$65,2,FALSE)","v":18},{"$f":"IF($G17>0,VLOOKUP($G17,DrawPrep!$A$3:$F$66,6,FALSE),0)","v":0},{"$f":"IF(Setup!$B$24=\"#\",0,IF($G17>0,VLOOKUP($G17,DrawPrep!$A$3:$F$66,3,FALSE),0))","v":37253},{"$f":"IF($I17>0,VLOOKUP($I17,DrawPrep!$C$3:$F$66,2,FALSE),\"bye\")","v":"ΓΙΑΝΝΑΚΟΠΟΥΛΟΣ ΔΙΟΝΥΣΙΟΣ"},"ΓΙΑΝΝΑΚΟΠΟΥΛΟΣ",{"$f":"IF($I17>0,VLOOKUP($I17,DrawPrep!$C$3:$F$66,3,FALSE),\"\")","v":"Α. Σ. ΚΟΛΛΕΓΙΟΥ ΝΤΕΡΗ"},null,{"$f":"UPPER(IF($A$2=\"R\",IF(OR(M17=1,M17=\"a\"),I17,IF(OR(M17=2,M17=\"b\"),I18,\"\")),IF(OR(M17=1,M17=\"a\"),K17,IF(OR(M17=2,M17=\"b\"),K18,\"\"))))","v":""}]
[14,{"$f":"11-D18+16","v":20},21,7,{"$f":"IF($B$2>=C18,1,0)","v":1},{"$f":"IF(NOT($G18=\"-\"),VLOOKUP($G18,DrawPrep!$A$3:$F$66,2,FALSE),\"\")","v":""},{"$f":"IF($B$2>=C18,\"-\",VLOOKUP($B18,Setup!$K$2:$L$65,2,FALSE))","v":"-"},{"$f":"IF(NOT($G18=\"-\"),VLOOKUP($G18,DrawPrep!$A$3:$F$66,6,FALSE),0)","v":0},{"$f":"IF(Setup!$B$24=\"#\",0,IF(NOT($G18=\"-\"),VLOOKUP($G18,DrawPrep!$A$3:$F$66,3,FALSE),0))","v":0},{"$f":"IF($I18>0,VLOOKUP($I18,DrawPrep!$C$3:$F$66,2,FALSE),\"bye\")","v":"bye"},"",{"$f":"IF($I18>0,VLOOKUP($I18,DrawPrep!$C$3:$F$66,3,FALSE),\"\")","v":""},null,null,null,{"$f":"UPPER(IF($A$2=\"R\",IF(OR(O18=1,O18=\"a\"),N17,IF(OR(O18=2,O18=\"b\"),N19,\"\")),IF(OR(O18=1,O18=\"a\"),N17,IF(OR(O18=2,O18=\"b\"),N19,\"\"))))","v":""}]
[15,{"$f":"12-D19+16","v":20},{"$f":"B20","v":7},8,{"$f":"IF($B$2>=C19,1,0)","v":1},{"$f":"IF(NOT($G19=\"-\"),VLOOKUP($G19,DrawPrep!$A$3:$F$66,2,FALSE),\"\")","v":""},{"$f":"IF($B$2>=C19,\"-\",VLOOKUP($B19,Setup!$K$2:$L$65,2,FALSE))","v":"-"},{"$f":"IF(NOT($G19=\"-\"),VLOOKUP($G19,DrawPrep!$A$3:$F$66,6,FALSE),0)","v":0},{"$f":"IF(Setup!$B$24=\"#\",0,IF(NOT($G19=\"-\"),VLOOKUP($G19,DrawPrep!$A$3:$F$66,3,FALSE),0))","v":0},{"$f":"IF($I19>0,VLOOKUP($I19,DrawPrep!$C$3:$F$66,2,FALSE),\"bye\")","v":"bye"},"",{"$f":"IF($I19>0,VLOOKUP($I19,DrawPrep!$C$3:$F$66,3,FALSE),\"\")","v":""},null,{"$f":"UPPER(IF($A$2=\"R\",IF(OR(M19=1,M19=\"a\"),I19,IF(OR(M19=2,M19=\"b\"),I20,\"\")),IF(OR(M19=1,M19=\"a\"),K19,IF(OR(M19=2,M19=\"b\"),K20,\"\"))))","v":""}]
[16,{"$f":"VALUE(Setup!E5)","v":7},null,8,0,{"$f":"IF(NOT($G20=\"-\"),VLOOKUP($G20,DrawPrep!$A$3:$F$66,2,FALSE),\"\")","v":0},{"$f":"VLOOKUP($B20,Setup!$K$2:$L$65,2,FALSE)","v":7},{"$f":"IF($G20>0,VLOOKUP($G20,DrawPrep!$A$3:$F$66,6,FALSE),0)","v":17},{"$f":"IF(Setup!$B$24=\"#\",0,IF($G20>0,VLOOKUP($G20,DrawPrep!$A$3:$F$66,3,FALSE),0))","v":37444},{"$f":"IF($I20>0,VLOOKUP($I20,DrawPrep!$C$3:$F$66,2,FALSE),\"bye\")","v":"ΝΙΚΟΛΑΟΥ ΑΓΓΕΛΟΣ"},"ΝΙΚΟΛΑΟΥ",{"$f":"IF($I20>0,VLOOKUP($I20,DrawPrep!$C$3:$F$66,3,FALSE),\"\")","v":"Α.Ε.Τ. ΝΙΚΗ ΠΑΤΡΩΝ"},null,null,null,null,null,null,null,{"$f":"UPPER(IF($A$2=\"R\",IF(OR(S20=1,S20=\"a\"),T12,IF(OR(S20=2,S20=\"b\"),T28,\"\")),IF(OR(S20=1,S20=\"a\"),T12,IF(OR(S20=2,S20=\"b\"),T28,\"\"))))","v":""}]
[17,{"$f":"VALUE(Setup!E2)","v":3},null,8,0,{"$f":"IF(NOT($G21=\"-\"),VLOOKUP($G21,DrawPrep!$A$3:$F$66,2,FALSE),\"\")","v":0},{"$f":"VLOOKUP($B21,Setup!$K$2:$L$65,2,FALSE)","v":3},{"$f":"IF($G21>0,VLOOKUP($G21,DrawPrep!$A$3:$F$66,6,FALSE),0)","v":21},{"$f":"IF(Setup!$B$24=\"#\",0,IF($G21>0,VLOOKUP($G21,DrawPrep!$A$3:$F$66,3,FALSE),0))","v":33991},{"$f":"IF($I21>0,VLOOKUP($I21,DrawPrep!$C$3:$F$66,2,FALSE),\"bye\")","v":"ΛΑΜΠΡΟΠΟΥΛΟΣ ΜΙΧΑΛΗΣ"},"ΛΑΜΠΡΟΠΟΥΛΟΣ",{"$f":"IF($I21>0,VLOOKUP($I21,DrawPrep!$C$3:$F$66,3,FALSE),\"\")","v":"ΑΕΚ ΤΡΙΠΟΛΗΣ"},null,{"$f":"UPPER(IF($A$2=\"R\",IF(OR(M21=1,M21=\"a\"),I21,IF(OR(M21=2,M21=\"b\"),I22,\"\")),IF(OR(M21=1,M21=\"a\"),K21,IF(OR(M21=2,M21=\"b\"),K22,\"\"))))","v":""}]
[18,{"$f":"13-D22+16","v":20},{"$f":"B21","v":3},9,{"$f":"IF($B$2>=C22,1,0)","v":1},{"$f":"IF(NOT($G22=\"-\"),VLOOKUP($G22,DrawPrep!$A$3:$F$66,2,FALSE),\"\")","v":""},{"$f":"IF($B$2>=C22,\"-\",VLOOKUP($B22,Setup!$K$2:$L$65,2,FALSE))","v":"-"},{"$f":"IF(NOT($G22=\"-\"),VLOOKUP($G22,DrawPrep!$A$3:$F$66,6,FALSE),0)","v":0},{"$f":"IF(Setup!$B$24=\"#\",0,IF(NOT($G22=\"-\"),VLOOKUP($G22,DrawPrep!$A$3:$F$66,3,FALSE),0))","v":0},{"$f":"IF($I22>0,VLOOKUP($I22,DrawPrep!$C$3:$F$66,2,FALSE),\"bye\")","v":"bye"},"",{"$f":"IF($I22>0,VLOOKUP($I22,DrawPrep!$C$3:$F$66,3,FALSE),\"\")","v":""},null,null,null,{"$f":"UPPER(IF($A$2=\"R\",IF(OR(O22=1,O22=\"a\"),N21,IF(OR(O22=2,O22=\"b\"),N23,\"\")),IF(OR(O22=1,O22=\"a\"),N21,IF(OR(O22=2,O22=\"b\"),N23,\"\"))))","v":""}]
[19,{"$f":"14-D23+16","v":21},null,9,0,{"$f":"IF(NOT($G23=\"-\"),VLOOKUP($G23,DrawPrep!$A$3:$F$66,2,FALSE),\"\")","v":0},{"$f":"VLOOKUP($B23,Setup!$K$2:$L$65,2,FALSE)","v":22},{"$f":"IF($G23>0,VLOOKUP($G23,DrawPrep!$A$3:$F$66,6,FALSE),0)","v":0},{"$f":"IF(Setup!$B$24=\"#\",0,IF($G23>0,VLOOKUP($G23,DrawPrep!$A$3:$F$66,3,FALSE),0))","v":34921},{"$f":"IF($I23>0,VLOOKUP($I23,DrawPrep!$C$3:$F$66,2,FALSE),\"bye\")","v":"ΜΕΓΑΛΟΓΙΑΝΝΗΣ ΚΩΝΣΤΑΝΤΙΝΟΣ"},"ΜΕΓΑΛΟΓΙΑΝΝΗΣ",{"$f":"IF($I23>0,VLOOKUP($I23,DrawPrep!$C$3:$F$66,3,FALSE),\"\")","v":"ΑΙΟΛΟΣ ΑΘΛ. ΛΕΣΧΗ ΙΛΙΟΥ"},null,{"$f":"UPPER(IF($A$2=\"R\",IF(OR(M23=1,M23=\"a\"),I23,IF(OR(M23=2,M23=\"b\"),I24,\"\")),IF(OR(M23=1,M23=\"a\"),K23,IF(OR(M23=2,M23=\"b\"),K24,\"\"))))","v":""},null,null,null,null,null,null," "]
[20,{"$f":"15-D24+16","v":21},31,10,{"$f":"IF($B$2>=C24,1,0)","v":1},{"$f":"IF(NOT($G24=\"-\"),VLOOKUP($G24,DrawPrep!$A$3:$F$66,2,FALSE),\"\")","v":""},{"$f":"IF($B$2>=C24,\"-\",VLOOKUP($B24,Setup!$K$2:$L$65,2,FALSE))","v":"-"},{"$f":"IF(NOT($G24=\"-\"),VLOOKUP($G24,DrawPrep!$A$3:$F$66,6,FALSE),0)","v":0},{"$f":"IF(Setup!$B$24=\"#\",0,IF(NOT($G24=\"-\"),VLOOKUP($G24,DrawPrep!$A$3:$F$66,3,FALSE),0))","v":0},{"$f":"IF($I24>0,VLOOKUP($I24,DrawPrep!$C$3:$F$66,2,FALSE),\"bye\")","v":"bye"},"",{"$f":"IF($I24>0,VLOOKUP($I24,DrawPrep!$C$3:$F$66,3,FALSE),\"\")","v":""},null,null,null,null,null,{"$f":"UPPER(IF($A$2=\"R\",IF(OR(Q24=1,Q24=\"a\"),P22,IF(OR(Q24=2,Q24=\"b\"),P26,\"\")),IF(OR(Q24=1,Q24=\"a\"),P22,IF(OR(Q24=2,Q24=\"b\"),P26,\"\"))))","v":""}]
[21,{"$f":"16-D25+16","v":22},null,10,0,{"$f":"IF(NOT($G25=\"-\"),VLOOKUP($G25,DrawPrep!$A$3:$F$66,2,FALSE),\"\")","v":0},{"$f":"VLOOKUP($B25,Setup!$K$2:$L$65,2,FALSE)","v":17},{"$f":"IF($G25>0,VLOOKUP($G25,DrawPrep!$A$3:$F$66,6,FALSE),0)","v":0},{"$f":"IF(Setup!$B$24=\"#\",0,IF($G25>0,VLOOKUP($G25,DrawPrep!$A$3:$F$66,3,FALSE),0))","v":34016},{"$f":"IF($I25>0,VLOOKUP($I25,DrawPrep!$C$3:$F$66,2,FALSE),\"bye\")","v":"ΜΠΟΝΙΚΟΣ ΣΠΥΡΟΣ"},"ΜΠΟΝΙΚΟΣ",{"$f":"IF($I25>0,VLOOKUP($I25,DrawPrep!$C$3:$F$66,3,FALSE),\"\")","v":"ΖΑΚΥΝΘΙΝΟΣ Α.Ο.Α."},null,{"$f":"UPPER(IF($A$2=\"R\",IF(OR(M25=1,M25=\"a\"),I25,IF(OR(M25=2,M25=\"b\"),I26,\"\")),IF(OR(M25=1,M25=\"a\"),K25,IF(OR(M25=2,M25=\"b\"),K26,\"\"))))","v":""}]
[22,{"$f":"17-D26+16","v":22},19,11,{"$f":"IF($B$2>=C26,1,0)","v":1},{"$f":"IF(NOT($G26=\"-\"),VLOOKUP($G26,DrawPrep!$A$3:$F$66,2,FALSE),\"\")","v":""},{"$f":"IF($B$2>=C26,\"-\",VLOOKUP($B26,Setup!$K$2:$L$65,2,FALSE))","v":"-"},{"$f":"IF(NOT($G26=\"-\"),VLOOKUP($G26,DrawPrep!$A$3:$F$66,6,FALSE),0)","v":0},{"$f":"IF(Setup!$B$24=\"#\",0,IF(NOT($G26=\"-\"),VLOOKUP($G26,DrawPrep!$A$3:$F$66,3,FALSE),0))","v":0},{"$f":"IF($I26>0,VLOOKUP($I26,DrawPrep!$C$3:$F$66,2,FALSE),\"bye\")","v":"bye"},"",{"$f":"IF($I26>0,VLOOKUP($I26,DrawPrep!$C$3:$F$66,3,FALSE),\"\")","v":""},null,null,null,{"$f":"UPPER(IF($A$2=\"R\",IF(OR(O26=1,O26=\"a\"),N25,IF(OR(O26=2,O26=\"b\"),N27,\"\")),IF(OR(O26=1,O26=\"a\"),N25,IF(OR(O26=2,O26=\"b\"),N27,\"\"))))","v":""}]
[23,{"$f":"18-D27+16","v":22},{"$f":"B28","v":15},12,{"$f":"IF($B$2>=C27,1,0)","v":1},{"$f":"IF(NOT($G27=\"-\"),VLOOKUP($G27,DrawPrep!$A$3:$F$66,2,FALSE),\"\")","v":""},{"$f":"IF($B$2>=C27,\"-\",VLOOKUP($B27,Setup!$K$2:$L$65,2,FALSE))","v":"-"},{"$f":"IF(NOT($G27=\"-\"),VLOOKUP($G27,DrawPrep!$A$3:$F$66,6,FALSE),0)","v":0},{"$f":"IF(Setup!$B$24=\"#\",0,IF(NOT($G27=\"-\"),VLOOKUP($G27,DrawPrep!$A$3:$F$66,3,FALSE),0))","v":0},{"$f":"IF($I27>0,VLOOKUP($I27,DrawPrep!$C$3:$F$66,2,FALSE),\"bye\")","v":"bye"},"",{"$f":"IF($I27>0,VLOOKUP($I27,DrawPrep!$C$3:$F$66,3,FALSE),\"\")","v":""},null,{"$f":"UPPER(IF($A$2=\"R\",IF(OR(M27=1,M27=\"a\"),I27,IF(OR(M27=2,M27=\"b\"),I28,\"\")),IF(OR(M27=1,M27=\"a\"),K27,IF(OR(M27=2,M27=\"b\"),K28,\"\"))))","v":""}]
[24,{"$f":"VALUE(Setup!E16)","v":15},null,12,0,{"$f":"IF(NOT($G28=\"-\"),VLOOKUP($G28,DrawPrep!$A$3:$F$66,2,FALSE),\"\")","v":0},{"$f":"VLOOKUP($B28,Setup!$K$2:$L$65,2,FALSE)","v":15},{"$f":"IF($G28>0,VLOOKUP($G28,DrawPrep!$A$3:$F$66,6,FALSE),0)","v":0},{"$f":"IF(Setup!$B$24=\"#\",0,IF($G28>0,VLOOKUP($G28,DrawPrep!$A$3:$F$66,3,FALSE),0))","v":35978},{"$f":"IF($I28>0,VLOOKUP($I28,DrawPrep!$C$3:$F$66,2,FALSE),\"bye\")","v":"ΔΗΜΗΤΡΙΟΥ ΓΙΩΡΓΟΣ"},"ΔΗΜΗΤΡΙΟΥ",{"$f":"IF($I28>0,VLOOKUP($I28,DrawPrep!$C$3:$F$66,3,FALSE),\"\")","v":"ΑΟΑ ΠΑΠΑΓΟΥ"},null,null,null,null,null,null,null,{"$f":"UPPER(IF($A$2=\"R\",IF(OR(S28=1,S28=\"a\"),R24,IF(OR(S28=2,S28=\"b\"),R32,\"\")),IF(OR(S28=1,S28=\"a\"),R24,IF(OR(S28=2,S28=\"b\"),R32,\"\"))))","v":""}]
[25,{"$f":"VALUE(Setup!E11)","v":11},null,12,0,{"$f":"IF(NOT($G29=\"-\"),VLOOKUP($G29,DrawPrep!$A$3:$F$66,2,FALSE),\"\")","v":0},{"$f":"VLOOKUP($B29,Setup!$K$2:$L$65,2,FALSE)","v":11},{"$f":"IF($G29>0,VLOOKUP($G29,DrawPrep!$A$3:$F$66,6,FALSE),0)","v":13},{"$f":"IF(Setup!$B$24=\"#\",0,IF($G29>0,VLOOKUP($G29,DrawPrep!$A$3:$F$66,3,FALSE),0))","v":37434},{"$f":"IF($I29>0,VLOOKUP($I29,DrawPrep!$C$3:$F$66,2,FALSE),\"bye\")","v":"ΚΑΤΑΠΟΔΗΣ ΓΙΩΡΓΟΣ"},"ΚΑΤΑΠΟΔΗΣ",{"$f":"IF($I29>0,VLOOKUP($I29,DrawPrep!$C$3:$F$66,3,FALSE),\"\")","v":"ΑΟΑ ΠΑΤΡΩΝ"},null,{"$f":"UPPER(IF($A$2=\"R\",IF(OR(M29=1,M29=\"a\"),I29,IF(OR(M29=2,M29=\"b\"),I30,\"\")),IF(OR(M29=1,M29=\"a\"),K29,IF(OR(M29=2,M29=\"b\"),K30,\"\"))))","v":""}]
[26,{"$f":"19-D30+16","v":22},{"$f":"B29","v":11},13,{"$f":"IF($B$2>=C30,1,0)","v":1},{"$f":"IF(NOT($G30=\"-\"),VLOOKUP($G30,DrawPrep!$A$3:$F$66,2,FALSE),\"\")","v":""},{"$f":"IF($B$2>=C30,\"-\",VLOOKUP($B30,Setup!$K$2:$L$65,2,FALSE))","v":"-"},{"$f":"IF(NOT($G30=\"-\"),VLOOKUP($G30,DrawPrep!$A$3:$F$66,6,FALSE),0)","v":0},{"$f":"IF(Setup!$B$24=\"#\",0,IF(NOT($G30=\"-\"),VLOOKUP($G30,DrawPrep!$A$3:$F$66,3,FALSE),0))","v":0},{"$f":"IF($I30>0,VLOOKUP($I30,DrawPrep!$C$3:$F$66,2,FALSE),\"bye\")","v":"bye"},"",{"$f":"IF($I30>0,VLOOKUP($I30,DrawPrep!$C$3:$F$66,3,FALSE),\"\")","v":""},null,null,null,{"$f":"UPPER(IF($A$2=\"R\",IF(OR(O30=1,O30=\"a\"),N29,IF(OR(O30=2,O30=\"b\"),N31,\"\")),IF(OR(O30=1,O30=\"a\"),N29,IF(OR(O30=2,O30=\"b\"),N31,\"\"))))","v":""}]
[27,{"$f":"20-D31+16","v":23},null,13,0,{"$f":"IF(NOT($G31=\"-\"),VLOOKUP($G31,DrawPrep!$A$3:$F$66,2,FALSE),\"\")","v":{"$error":"#N/A"}},{"$f":"VLOOKUP($B31,Setup!$K$2:$L$65,2,FALSE)","v":{"$error":"#N/A"}},{"$f":"IF($G31>0,VLOOKUP($G31,DrawPrep!$A$3:$F$66,6,FALSE),0)","v":{"$error":"#N/A"}},{"$f":"IF(Setup!$B$24=\"#\",0,IF($G31>0,VLOOKUP($G31,DrawPrep!$A$3:$F$66,3,FALSE),0))","v":{"$error":"#N/A"}},{"$f":"IF($I31>0,VLOOKUP($I31,DrawPrep!$C$3:$F$66,2,FALSE),\"bye\")","v":{"$error":"#N/A"}},{"$error":"#N/A"},{"$f":"IF($I31>0,VLOOKUP($I31,DrawPrep!$C$3:$F$66,3,FALSE),\"\")","v":{"$error":"#N/A"}},null,{"$f":"UPPER(IF($A$2=\"R\",IF(OR(M31=1,M31=\"a\"),I31,IF(OR(M31=2,M31=\"b\"),I32,\"\")),IF(OR(M31=1,M31=\"a\"),K31,IF(OR(M31=2,M31=\"b\"),K32,\"\"))))","v":""}]
[28,{"$f":"21-D32+16","v":23},27,14,{"$f":"IF($B$2>=C32,1,0)","v":1},{"$f":"IF(NOT($G32=\"-\"),VLOOKUP($G32,DrawPrep!$A$3:$F$66,2,FALSE),\"\")","v":""},{"$f":"IF($B$2>=C32,\"-\",VLOOKUP($B32,Setup!$K$2:$L$65,2,FALSE))","v":"-"},{"$f":"IF(NOT($G32=\"-\"),VLOOKUP($G32,DrawPrep!$A$3:$F$66,6,FALSE),0)","v":0},{"$f":"IF(Setup!$B$24=\"#\",0,IF(NOT($G32=\"-\"),VLOOKUP($G32,DrawPrep!$A$3:$F$66,3,FALSE),0))","v":0},{"$f":"IF($I32>0,VLOOKUP($I32,DrawPrep!$C$3:$F$66,2,FALSE),\"bye\")","v":"bye"},"",{"$f":"IF($I32>0,VLOOKUP($I32,DrawPrep!$C$3:$F$66,3,FALSE),\"\")","v":""},null,null,null,null,null,{"$f":"UPPER(IF($A$2=\"R\",IF(OR(Q32=1,Q32=\"a\"),P30,IF(OR(Q32=2,Q32=\"b\"),P34,\"\")),IF(OR(Q32=1,Q32=\"a\"),P30,IF(OR(Q32=2,Q32=\"b\"),P34,\"\"))))","v":""}]
[29,{"$f":"22-D33+16","v":24},null,14,0,{"$f":"IF(NOT($G33=\"-\"),VLOOKUP($G33,DrawPrep!$A$3:$F$66,2,FALSE),\"\")","v":{"$error":"#N/A"}},{"$f":"VLOOKUP($B33,Setup!$K$2:$L$65,2,FALSE)","v":{"$error":"#N/A"}},{"$f":"IF($G33>0,VLOOKUP($G33,DrawPrep!$A$3:$F$66,6,FALSE),0)","v":{"$error":"#N/A"}},{"$f":"IF(Setup!$B$24=\"#\",0,IF($G33>0,VLOOKUP($G33,DrawPrep!$A$3:$F$66,3,FALSE),0))","v":{"$error":"#N/A"}},{"$f":"IF($I33>0,VLOOKUP($I33,DrawPrep!$C$3:$F$66,2,FALSE),\"bye\")","v":{"$error":"#N/A"}},{"$error":"#N/A"},{"$f":"IF($I33>0,VLOOKUP($I33,DrawPrep!$C$3:$F$66,3,FALSE),\"\")","v":{"$error":"#N/A"}},null,{"$f":"UPPER(IF($A$2=\"R\",IF(OR(M33=1,M33=\"a\"),I33,IF(OR(M33=2,M33=\"b\"),I34,\"\")),IF(OR(M33=1,M33=\"a\"),K33,IF(OR(M33=2,M33=\"b\"),K34,\"\"))))","v":""}]
[30,{"$f":"23-D34+16","v":24},23,15,{"$f":"IF($B$2>=C34,1,0)","v":1},{"$f":"IF(NOT($G34=\"-\"),VLOOKUP($G34,DrawPrep!$A$3:$F$66,2,FALSE),\"\")","v":""},{"$f":"IF($B$2>=C34,\"-\",VLOOKUP($B34,Setup!$K$2:$L$65,2,FALSE))","v":"-"},{"$f":"IF(NOT($G34=\"-\"),VLOOKUP($G34,DrawPrep!$A$3:$F$66,6,FALSE),0)","v":0},{"$f":"IF(Setup!$B$24=\"#\",0,IF(NOT($G34=\"-\"),VLOOKUP($G34,DrawPrep!$A$3:$F$66,3,FALSE),0))","v":0},{"$f":"IF($I34>0,VLOOKUP($I34,DrawPrep!$C$3:$F$66,2,FALSE),\"bye\")","v":"bye"},"",{"$f":"IF($I34>0,VLOOKUP($I34,DrawPrep!$C$3:$F$66,3,FALSE),\"\")","v":""},null,null,null,{"$f":"UPPER(IF($A$2=\"R\",IF(OR(O34=1,O34=\"a\"),N33,IF(OR(O34=2,O34=\"b\"),N35,\"\")),IF(OR(O34=1,O34=\"a\"),N33,IF(OR(O34=2,O34=\"b\"),N35,\"\"))))","v":""},null,"finalists",null,"winner"]
[31,{"$f":"24-D35+16","v":24},{"$f":"B36","v":5},16,{"$f":"IF($B$2>=C35,1,0)","v":1},{"$f":"IF(NOT($G35=\"-\"),VLOOKUP($G35,DrawPrep!$A$3:$F$66,2,FALSE),\"\")","v":""},{"$f":"IF($B$2>=C35,\"-\",VLOOKUP($B35,Setup!$K$2:$L$65,2,FALSE))","v":"-"},{"$f":"IF(NOT($G35=\"-\"),VLOOKUP($G35,DrawPrep!$A$3:$F$66,6,FALSE),0)","v":0},{"$f":"IF(Setup!$B$24=\"#\",0,IF(NOT($G35=\"-\"),VLOOKUP($G35,DrawPrep!$A$3:$F$66,3,FALSE),0))","v":0},{"$f":"IF($I35>0,VLOOKUP($I35,DrawPrep!$C$3:$F$66,2,FALSE),\"bye\")","v":"bye"},"",{"$f":"IF($I35>0,VLOOKUP($I35,DrawPrep!$C$3:$F$66,3,FALSE),\"\")","v":""},null,{"$f":"UPPER(IF($A$2=\"R\",IF(OR(M35=1,M35=\"a\"),I35,IF(OR(M35=2,M35=\"b\"),I36,\"\")),IF(OR(M35=1,M35=\"a\"),K35,IF(OR(M35=2,M35=\"b\"),K36,\"\"))))","v":""}]
[32,{"$f":"VALUE(Setup!E6)","v":5},null,16,0,{"$f":"IF(NOT($G36=\"-\"),VLOOKUP($G36,DrawPrep!$A$3:$F$66,2,FALSE),\"\")","v":0},{"$f":"VLOOKUP($B36,Setup!$K$2:$L$65,2,FALSE)","v":5},{"$f":"IF($G36>0,VLOOKUP($G36,DrawPrep!$A$3:$F$66,6,FALSE),0)","v":19},{"$f":"IF(Setup!$B$24=\"#\",0,IF($G36>0,VLOOKUP($G36,DrawPrep!$A$3:$F$66,3,FALSE),0))","v":32434},{"$f":"IF($I36>0,VLOOKUP($I36,DrawPrep!$C$3:$F$66,2,FALSE),\"bye\")","v":"ΡΟΖΗΣ ΔΗΜΗΤΡΗΣ"},"ΡΟΖΗΣ",{"$f":"IF($I36>0,VLOOKUP($I36,DrawPrep!$C$3:$F$66,3,FALSE),\"\")","v":"Α.Ε.Τ. ΝΙΚΗ ΠΑΤΡΩΝ"},null,null,null,null,null,{"$f":"T20","v":""},null,{"$f":"UPPER(IF($A$2=\"R\",IF(OR(S36=1,S36=\"a\"),R36,IF(OR(S36=2,S36=\"b\"),R37,\"\")),IF(OR(S36=1,S36=\"a\"),R36,IF(OR(S36=2,S36=\"b\"),R37,\"\"))))","v":""}]
[33,{"$f":"VALUE(Setup!E7)","v":8},null,16,0,{"$f":"IF(NOT($G37=\"-\"),VLOOKUP($G37,DrawPrep!$A$3:$F$66,2,FALSE),\"\")","v":0},{"$f":"VLOOKUP($B37,Setup!$K$2:$L$65,2,FALSE)","v":8},{"$f":"IF($G37>0,VLOOKUP($G37,DrawPrep!$A$3:$F$66,6,FALSE),0)","v":16},{"$f":"IF(Setup!$B$24=\"#\",0,IF($G37>0,VLOOKUP($G37,DrawPrep!$A$3:$F$66,3,FALSE),0))","v":37478},{"$f":"IF($I37>0,VLOOKUP($I37,DrawPrep!$C$3:$F$66,2,FALSE),\"bye\")","v":"ΚΑΡΑΟΥΛΑΝΗΣ ΒΑΣΙΛΕΙΟΣ"},"ΚΑΡΑΟΥΛΑΝΗΣ",{"$f":"IF($I37>0,VLOOKUP($I37,DrawPrep!$C$3:$F$66,3,FALSE),\"\")","v":"Ο.Α. ΦΟΙΒΟΣ ΛΑΡΙΣΑΣ"},null,{"$f":"UPPER(IF($A$2=\"R\",IF(OR(M37=1,M37=\"a\"),I37,IF(OR(M37=2,M37=\"b\"),I38,\"\")),IF(OR(M37=1,M37=\"1\"),K37,IF(OR(M37=2,M37=\"b\"),K38,\"\"))))","v":""},null,null,null,{"$f":"T52","v":""}]
[34,{"$f":"25-D38+16","v":24},{"$f":"B37","v":8},17,{"$f":"IF($B$2>=C38,1,0)","v":1},{"$f":"IF(NOT($G38=\"-\"),VLOOKUP($G38,DrawPrep!$A$3:$F$66,2,FALSE),\"\")","v":""},{"$f":"IF($B$2>=C38,\"-\",VLOOKUP($B38,Setup!$K$2:$L$65,2,FALSE))","v":"-"},{"$f":"IF(NOT($G38=\"-\"),VLOOKUP($G38,DrawPrep!$A$3:$F$66,6,FALSE),0)","v":0},{"$f":"IF(Setup!$B$24=\"#\",0,IF(NOT($G38=\"-\"),VLOOKUP($G38,DrawPrep!$A$3:$F$66,3,FALSE),0))","v":0},{"$f":"IF($I38>0,VLOOKUP($I38,DrawPrep!$C$3:$F$66,2,FALSE),\"bye\")","v":"bye"},"",{"$f":"IF($I38>0,VLOOKUP($I38,DrawPrep!$C$3:$F$66,3,FALSE),\"\")","v":""},null,null,null,{"$f":"UPPER(IF($A$2=\"R\",IF(OR(O38=1,O38=\"a\"),N37,IF(OR(O38=2,O38=\"b\"),N39,\"\")),IF(OR(O38=1,O38=\"a\"),N37,IF(OR(O38=2,O38=\"b\"),N39,\"\"))))","v":""}]
[35,{"$f":"26-D39+16","v":25},null,17,0,{"$f":"IF(NOT($G39=\"-\"),VLOOKUP($G39,DrawPrep!$A$3:$F$66,2,FALSE),\"\")","v":{"$error":"#N/A"}},{"$f":"VLOOKUP($B39,Setup!$K$2:$L$65,2,FALSE)","v":{"$error":"#N/A"}},{"$f":"IF($G39>0,VLOOKUP($G39,DrawPrep!$A$3:$F$66,6,FALSE),0)","v":{"$error":"#N/A"}},{"$f":"IF(Setup!$B$24=\"#\",0,IF($G39>0,VLOOKUP($G39,DrawPrep!$A$3:$F$66,3,FALSE),0))","v":{"$error":"#N/A"}},{"$f":"IF($I39>0,VLOOKUP($I39,DrawPrep!$C$3:$F$66,2,FALSE),\"bye\")","v":{"$error":"#N/A"}},{"$error":"#N/A"},{"$f":"IF($I39>0,VLOOKUP($I39,DrawPrep!$C$3:$F$66,3,FALSE),\"\")","v":{"$error":"#N/A"}},null,{"$f":"UPPER(IF($A$2=\"R\",IF(OR(M39=1,M39=\"a\"),I39,IF(OR(M39=2,M39=\"b\"),I40,\"\")),IF(OR(M39=1,M39=\"a\"),K39,IF(OR(M39=2,M39=\"b\"),K40,\"\"))))","v":""}]
[36,{"$f":"27-D40+16","v":25},28,18,{"$f":"IF($B$2>=C40,1,0)","v":1},{"$f":"IF(NOT($G40=\"-\"),VLOOKUP($G40,DrawPrep!$A$3:$F$66,2,FALSE),\"\")","v":""},{"$f":"IF($B$2>=C40,\"-\",VLOOKUP($B40,Setup!$K$2:$L$65,2,FALSE))","v":"-"},{"$f":"IF(NOT($G40=\"-\"),VLOOKUP($G40,DrawPrep!$A$3:$F$66,6,FALSE),0)","v":0},{"$f":"IF(Setup!$B$24=\"#\",0,IF(NOT($G40=\"-\"),VLOOKUP($G40,DrawPrep!$A$3:$F$66,3,FALSE),0))","v":0},{"$f":"IF($I40>0,VLOOKUP($I40,DrawPrep!$C$3:$F$66,2,FALSE),\"bye\")","v":"bye"},"",{"$f":"IF($I40>0,VLOOKUP($I40,DrawPrep!$C$3:$F$66,3,FALSE),\"\")","v":""},null,null,null,null,null,{"$f":"UPPER(IF($A$2=\"R\",IF(OR(Q40=1,Q40=\"a\"),P38,IF(OR(Q40=2,Q40=\"b\"),P42,\"\")),IF(OR(Q40=1,Q40=\"a\"),P38,IF(OR(Q40=2,Q40=\"b\"),P42,\"\"))))","v":""}]
[37,{"$f":"28-D41+16","v":26},null,18,0,{"$f":"IF(NOT($G41=\"-\"),VLOOKUP($G41,DrawPrep!$A$3:$F$66,2,FALSE),\"\")","v":{"$error":"#N/A"}},{"$f":"VLOOKUP($B41,Setup!$K$2:$L$65,2,FALSE)","v":{"$error":"#N/A"}},{"$f":"IF($G41>0,VLOOKUP($G41,DrawPrep!$A$3:$F$66,6,FALSE),0)","v":{"$error":"#N/A"}},{"$f":"IF(Setup!$B$24=\"#\",0,IF($G41>0,VLOOKUP($G41,DrawPrep!$A$3:$F$66,3,FALSE),0))","v":{"$error":"#N/A"}},{"$f":"IF($I41>0,VLOOKUP($I41,DrawPrep!$C$3:$F$66,2,FALSE),\"bye\")","v":{"$error":"#N/A"}},{"$error":"#N/A"},{"$f":"IF($I41>0,VLOOKUP($I41,DrawPrep!$C$3:$F$66,3,FALSE),\"\")","v":{"$error":"#N/A"}},null,{"$f":"UPPER(IF($A$2=\"R\",IF(OR(M41=1,M41=\"a\"),I41,IF(OR(M41=2,M41=\"b\"),I42,\"\")),IF(OR(M41=1,M41=\"a\"),K41,IF(OR(M41=2,M41=\"b\"),K42,\"\"))))","v":""}]
[38,{"$f":"29-D42+16","v":26},20,19,{"$f":"IF($B$2>=C42,1,0)","v":1},{"$f":"IF(NOT($G42=\"-\"),VLOOKUP($G42,DrawPrep!$A$3:$F$66,2,FALSE),\"\")","v":""},{"$f":"IF($B$2>=C42,\"-\",VLOOKUP($B42,Setup!$K$2:$L$65,2,FALSE))","v":"-"},{"$f":"IF(NOT($G42=\"-\"),VLOOKUP($G42,DrawPrep!$A$3:$F$66,6,FALSE),0)","v":0},{"$f":"IF(Setup!$B$24=\"#\",0,IF(NOT($G42=\"-\"),VLOOKUP($G42,DrawPrep!$A$3:$F$66,3,FALSE),0))","v":0},{"$f":"IF($I42>0,VLOOKUP($I42,DrawPrep!$C$3:$F$66,2,FALSE),\"bye\")","v":"bye"},"",{"$f":"IF($I42>0,VLOOKUP($I42,DrawPrep!$C$3:$F$66,3,FALSE),\"\")","v":""},null,null,null,{"$f":"UPPER(IF($A$2=\"R\",IF(OR(O42=1,O42=\"a\"),N41,IF(OR(O42=2,O42=\"b\"),N43,\"\")),IF(OR(O42=1,O42=\"a\"),N41,IF(OR(O42=2,O42=\"b\"),N43,\"\"))))","v":""}]
[39,{"$f":"30-D43+16","v":26},{"$f":"B44","v":10},20,{"$f":"IF($B$2>=C43,1,0)","v":1},{"$f":"IF(NOT($G43=\"-\"),VLOOKUP($G43,DrawPrep!$A$3:$F$66,2,FALSE),\"\")","v":""},{"$f":"IF($B$2>=C43,\"-\",VLOOKUP($B43,Setup!$K$2:$L$65,2,FALSE))","v":"-"},{"$f":"IF(NOT($G43=\"-\"),VLOOKUP($G43,DrawPrep!$A$3:$F$66,6,FALSE),0)","v":0},{"$f":"IF(Setup!$B$24=\"#\",0,IF(NOT($G43=\"-\"),VLOOKUP($G43,DrawPrep!$A$3:$F$66,3,FALSE),0))","v":0},{"$f":"IF($I43>0,VLOOKUP($I43,DrawPrep!$C$3:$F$66,2,FALSE),\"bye\")","v":"bye"},"",{"$f":"IF($I43>0,VLOOKUP($I43,DrawPrep!$C$3:$F$66,3,FALSE),\"\")","v":""},null,{"$f":"UPPER(IF($A$2=\"R\",IF(OR(M43=1,M43=\"a\"),I43,IF(OR(M43=2,M43=\"b\"),I44,\"\")),IF(OR(M43=1,M43=\"a\"),K43,IF(OR(M43=2,M43=\"b\"),K44,\"\"))))","v":""}]
[40,{"$f":"VALUE(Setup!E12)","v":10},null,20,0,{"$f":"IF(NOT($G44=\"-\"),VLOOKUP($G44,DrawPrep!$A$3:$F$66,2,FALSE),\"\")","v":0},{"$f":"VLOOKUP($B44,Setup!$K$2:$L$65,2,FALSE)","v":10},{"$f":"IF($G44>0,VLOOKUP($G44,DrawPrep!$A$3:$F$66,6,FALSE),0)","v":14},{"$f":"IF(Setup!$B$24=\"#\",0,IF($G44>0,VLOOKUP($G44,DrawPrep!$A$3:$F$66,3,FALSE),0))","v":33122},{"$f":"IF($I44>0,VLOOKUP($I44,DrawPrep!$C$3:$F$66,2,FALSE),\"bye\")","v":"ΑΦΑΛΩΝΙΑΤΗΣ ΘΑΝΟΣ"},"ΑΦΑΛΩΝΙΑΤΗΣ",{"$f":"IF($I44>0,VLOOKUP($I44,DrawPrep!$C$3:$F$66,3,FALSE),\"\")","v":"Α.Ε.Τ. ΝΙΚΗ ΠΑΤΡΩΝ"},null,null,null,null,null,null,null,{"$f":"UPPER(IF($A$2=\"R\",IF(OR(S44=1,S44=\"a\"),R40,IF(OR(S44=2,S44=\"b\"),R48,\"\")),IF(OR(S44=1,S44=\"a\"),R40,IF(OR(S44=2,S44=\"b\"),R48,\"\"))))","v":""}]
[41,{"$f":"VALUE(Setup!E17)","v":16},null,20,0,{"$f":"IF(NOT($G45=\"-\"),VLOOKUP($G45,DrawPrep!$A$3:$F$66,2,FALSE),\"\")","v":0},{"$f":"VLOOKUP($B45,Setup!$K$2:$L$65,2,FALSE)","v":16},{"$f":"IF($G45>0,VLOOKUP($G45,DrawPrep!$A$3:$F$66,6,FALSE),0)","v":0},{"$f":"IF(Setup!$B$24=\"#\",0,IF($G45>0,VLOOKUP($G45,DrawPrep!$A$3:$F$66,3,FALSE),0))","v":37664},{"$f":"IF($I45>0,VLOOKUP($I45,DrawPrep!$C$3:$F$66,2,FALSE),\"bye\")","v":"ΚΑΥΜΕΝΑΚΗΣ ΑΡΙΣΤΟΤΕΛΗΣ"},"ΚΑΥΜΕΝΑΚΗΣ",{"$f":"IF($I45>0,VLOOKUP($I45,DrawPrep!$C$3:$F$66,3,FALSE),\"\")","v":"Ο.Α. ΧΑΝΙΩΝ"},null,{"$f":"UPPER(IF($A$2=\"R\",IF(OR(M45=1,M45=\"a\"),I45,IF(OR(M45=2,M45=\"b\"),I46,\"\")),IF(OR(M45=1,M45=\"a\"),K45,IF(OR(M45=2,M45=\"b\"),K46,\"\"))))","v":""}]
[42,{"$f":"31-D46+16","v":26},{"$f":"B45","v":16},21,{"$f":"IF($B$2>=C46,1,0)","v":1},{"$f":"IF(NOT($G46=\"-\"),VLOOKUP($G46,DrawPrep!$A$3:$F$66,2,FALSE),\"\")","v":""},{"$f":"IF($B$2>=C46,\"-\",VLOOKUP($B46,Setup!$K$2:$L$65,2,FALSE))","v":"-"},{"$f":"IF(NOT($G46=\"-\"),VLOOKUP($G46,DrawPrep!$A$3:$F$66,6,FALSE),0)","v":0},{"$f":"IF(Setup!$B$24=\"#\",0,IF(NOT($G46=\"-\"),VLOOKUP($G46,DrawPrep!$A$3:$F$66,3,FALSE),0))","v":0},{"$f":"IF($I46>0,VLOOKUP($I46,DrawPrep!$C$3:$F$66,2,FALSE),\"bye\")","v":"bye"},"",{"$f":"IF($I46>0,VLOOKUP($I46,DrawPrep!$C$3:$F$66,3,FALSE),\"\")","v":""},null,null,null,{"$f":"UPPER(IF($A$2=\"R\",IF(OR(O46=1,O46=\"a\"),N45,IF(OR(O46=2,O46=\"b\"),N47,\"\")),IF(OR(O46=1,O46=\"a\"),N45,IF(OR(O46=2,O46=\"b\"),N47,\"\"))))","v":""}]
[43,{"$f":"32-D47+16","v":27},null,21,0,{"$f":"IF(NOT($G47=\"-\"),VLOOKUP($G47,DrawPrep!$A$3:$F$66,2,FALSE),\"\")","v":{"$error":"#N/A"}},{"$f":"VLOOKUP($B47,Setup!$K$2:$L$65,2,FALSE)","v":{"$error":"#N/A"}},{"$f":"IF($G47>0,VLOOKUP($G47,DrawPrep!$A$3:$F$66,6,FALSE),0)","v":{"$error":"#N/A"}},{"$f":"IF(Setup!$B$24=\"#\",0,IF($G47>0,VLOOKUP($G47,DrawPrep!$A$3:$F$66,3,FALSE),0))","v":{"$error":"#N/A"}},{"$f":"IF($I47>0,VLOOKUP($I47,DrawPrep!$C$3:$F$66,2,FALSE),\"bye\")","v":{"$error":"#N/A"}},{"$error":"#N/A"},{"$f":"IF($I47>0,VLOOKUP($I47,DrawPrep!$C$3:$F$66,3,FALSE),\"\")","v":{"$error":"#N/A"}},null,{"$f":"UPPER(IF($A$2=\"R\",IF(OR(M47=1,M47=\"a\"),I47,IF(OR(M47=2,M47=\"b\"),I48,\"\")),IF(OR(M47=1,M47=\"a\"),K47,IF(OR(M47=2,M47=\"b\"),K48,\"\"))))","v":""}]
[44,{"$f":"33-D48+16","v":27},24,22,{"$f":"IF($B$2>=C48,1,0)","v":1},{"$f":"IF(NOT($G48=\"-\"),VLOOKUP($G48,DrawPrep!$A$3:$F$66,2,FALSE),\"\")","v":""},{"$f":"IF($B$2>=C48,\"-\",VLOOKUP($B48,Setup!$K$2:$L$65,2,FALSE))","v":"-"},{"$f":"IF(NOT($G48=\"-\"),VLOOKUP($G48,DrawPrep!$A$3:$F$66,6,FALSE),0)","v":0},{"$f":"IF(Setup!$B$24=\"#\",0,IF(NOT($G48=\"-\"),VLOOKUP($G48,DrawPrep!$A$3:$F$66,3,FALSE),0))","v":0},{"$f":"IF($I48>0,VLOOKUP($I48,DrawPrep!$C$3:$F$66,2,FALSE),\"bye\")","v":"bye"},"",{"$f":"IF($I48>0,VLOOKUP($I48,DrawPrep!$C$3:$F$66,3,FALSE),\"\")","v":""},null,null,null,null,null,{"$f":"UPPER(IF($A$2=\"R\",IF(OR(Q48=1,Q48=\"a\"),P46,IF(OR(Q48=2,Q48=\"b\"),P50,\"\")),IF(OR(Q48=1,Q48=\"a\"),P46,IF(OR(Q48=2,Q48=\"b\"),P50,\"\"))))","v":""}]
[45,{"$f":"34-D49+16","v":28},null,22,0,{"$f":"IF(NOT($G49=\"-\"),VLOOKUP($G49,DrawPrep!$A$3:$F$66,2,FALSE),\"\")","v":{"$error":"#N/A"}},{"$f":"VLOOKUP($B49,Setup!$K$2:$L$65,2,FALSE)","v":{"$error":"#N/A"}},{"$f":"IF($G49>0,VLOOKUP($G49,DrawPrep!$A$3:$F$66,6,FALSE),0)","v":{"$error":"#N/A"}},{"$f":"IF(Setup!$B$24=\"#\",0,IF($G49>0,VLOOKUP($G49,DrawPrep!$A$3:$F$66,3,FALSE),0))","v":{"$error":"#N/A"}},{"$f":"IF($I49>0,VLOOKUP($I49,DrawPrep!$C$3:$F$66,2,FALSE),\"bye\")","v":{"$error":"#N/A"}},{"$error":"#N/A"},{"$f":"IF($I49>0,VLOOKUP($I49,DrawPrep!$C$3:$F$66,3,FALSE),\"\")","v":{"$error":"#N/A"}},null,{"$f":"UPPER(IF($A$2=\"R\",IF(OR(M49=1,M49=\"a\"),I49,IF(OR(M49=2,M49=\"b\"),I50,\"\")),IF(OR(M49=1,M49=\"a\"),K49,IF(OR(M49=2,M49=\"b\"),K50,\"\"))))","v":""}]
[46,{"$f":"35-D50+16","v":28},32,23,{"$f":"IF($B$2>=C50,1,0)","v":1},{"$f":"IF(NOT($G50=\"-\"),VLOOKUP($G50,DrawPrep!$A$3:$F$66,2,FALSE),\"\")","v":""},{"$f":"IF($B$2>=C50,\"-\",VLOOKUP($B50,Setup!$K$2:$L$65,2,FALSE))","v":"-"},{"$f":"IF(NOT($G50=\"-\"),VLOOKUP($G50,DrawPrep!$A$3:$F$66,6,FALSE),0)","v":0},{"$f":"IF(Setup!$B$24=\"#\",0,IF(NOT($G50=\"-\"),VLOOKUP($G50,DrawPrep!$A$3:$F$66,3,FALSE),0))","v":0},{"$f":"IF($I50>0,VLOOKUP($I50,DrawPrep!$C$3:$F$66,2,FALSE),\"bye\")","v":"bye"},"",{"$f":"IF($I50>0,VLOOKUP($I50,DrawPrep!$C$3:$F$66,3,FALSE),\"\")","v":""},null,null,null,{"$f":"UPPER(IF($A$2=\"R\",IF(OR(O50=1,O50=\"a\"),N49,IF(OR(O50=2,O50=\"b\"),N51,\"\")),IF(OR(O50=1,O50=\"a\"),N49,IF(OR(O50=2,O50=\"b\"),N51,\"\"))))","v":""}]
[47,{"$f":"36-D51+16","v":28},{"$f":"B52","v":4},24,{"$f":"IF($B$2>=C51,1,0)","v":1},{"$f":"IF(NOT($G51=\"-\"),VLOOKUP($G51,DrawPrep!$A$3:$F$66,2,FALSE),\"\")","v":""},{"$f":"IF($B$2>=C51,\"-\",VLOOKUP($B51,Setup!$K$2:$L$65,2,FALSE))","v":"-"},{"$f":"IF(NOT($G51=\"-\"),VLOOKUP($G51,DrawPrep!$A$3:$F$66,6,FALSE),0)","v":0},{"$f":"IF(Setup!$B$24=\"#\",0,IF(NOT($G51=\"-\"),VLOOKUP($G51,DrawPrep!$A$3:$F$66,3,FALSE),0))","v":0},{"$f":"IF($I51>0,VLOOKUP($I51,DrawPrep!$C$3:$F$66,2,FALSE),\"bye\")","v":"bye"},"",{"$f":"IF($I51>0,VLOOKUP($I51,DrawPrep!$C$3:$F$66,3,FALSE),\"\")","v":""},null,{"$f":"UPPER(IF($A$2=\"R\",IF(OR(M51=1,M51=\"a\"),I51,IF(OR(M51=2,M51=\"b\"),I52,\"\")),IF(OR(M51=1,M51=\"a\"),K51,IF(OR(M51=2,M51=\"b\"),K52,\"\"))))","v":""}]
[48,{"$f":"VALUE(Setup!E3)","v":4},null,24,0,{"$f":"IF(NOT($G52=\"-\"),VLOOKUP($G52,DrawPrep!$A$3:$F$66,2,FALSE),\"\")","v":0},{"$f":"VLOOKUP($B52,Setup!$K$2:$L$65,2,FALSE)","v":4},{"$f":"IF($G52>0,VLOOKUP($G52,DrawPrep!$A$3:$F$66,6,FALSE),0)","v":20},{"$f":"IF(Setup!$B$24=\"#\",0,IF($G52>0,VLOOKUP($G52,DrawPrep!$A$3:$F$66,3,FALSE),0))","v":40000},{"$f":"IF($I52>0,VLOOKUP($I52,DrawPrep!$C$3:$F$66,2,FALSE),\"bye\")","v":"ΓΟΥΔΕΛΗΣ ΔΗΜΗΤΡΗΣ"},"ΓΟΥΔΕΛΗΣ",{"$f":"IF($I52>0,VLOOKUP($I52,DrawPrep!$C$3:$F$66,3,FALSE),\"\")","v":"Α.Σ. ΑΣΤΕΡΑΣ ΠΕΝΤΕΛΙΚΟΥ"},null,null,null,null,null,null,null,{"$f":"UPPER(IF($A$2=\"R\",IF(OR(S52=1,S52=\"a\"),T44,IF(OR(S52=2,S52=\"b\"),T60,\"\")),IF(OR(S52=1,S52=\"a\"),T44,IF(OR(S52=2,S52=\"b\"),T60,\"\"))))","v":""}]
[49,{"$f":"VALUE(Setup!E8)","v":6},null,24,0,{"$f":"IF(NOT($G53=\"-\"),VLOOKUP($G53,DrawPrep!$A$3:$F$66,2,FALSE),\"\")","v":0},{"$f":"VLOOKUP($B53,Setup!$K$2:$L$65,2,FALSE)","v":6},{"$f":"IF($G53>0,VLOOKUP($G53,DrawPrep!$A$3:$F$66,6,FALSE),0)","v":18},{"$f":"IF(Setup!$B$24=\"#\",0,IF($G53>0,VLOOKUP($G53,DrawPrep!$A$3:$F$66,3,FALSE),0))","v":37981},{"$f":"IF($I53>0,VLOOKUP($I53,DrawPrep!$C$3:$F$66,2,FALSE),\"bye\")","v":"ΓΙΑΝΝΟΣ ΗΛΙΑΣ"},"ΓΙΑΝΝΟΣ",{"$f":"IF($I53>0,VLOOKUP($I53,DrawPrep!$C$3:$F$66,3,FALSE),\"\")","v":"Α.Γ.Ο. ΦΙΛΙΠΠΙΑΔΑΣ"},null,{"$f":"UPPER(IF($A$2=\"R\",IF(OR(M53=1,M53=\"a\"),I53,IF(OR(M53=2,M53=\"b\"),I54,\"\")),IF(OR(M53=1,M53=\"a\"),K53,IF(OR(M53=2,M53=\"b\"),K54,\"\"))))","v":""}]
[50,{"$f":"37-D54+16","v":28},{"$f":"B53","v":6},25,{"$f":"IF($B$2>=C54,1,0)","v":1},{"$f":"IF(NOT($G54=\"-\"),VLOOKUP($G54,DrawPrep!$A$3:$F$66,2,FALSE),\"\")","v":""},{"$f":"IF($B$2>=C54,\"-\",VLOOKUP($B54,Setup!$K$2:$L$65,2,FALSE))","v":"-"},{"$f":"IF(NOT($G54=\"-\"),VLOOKUP($G54,DrawPrep!$A$3:$F$66,6,FALSE),0)","v":0},{"$f":"IF(Setup!$B$24=\"#\",0,IF(NOT($G54=\"-\"),VLOOKUP($G54,DrawPrep!$A$3:$F$66,3,FALSE),0))","v":0},{"$f":"IF($I54>0,VLOOKUP($I54,DrawPrep!$C$3:$F$66,2,FALSE),\"bye\")","v":"bye"},"",{"$f":"IF($I54>0,VLOOKUP($I54,DrawPrep!$C$3:$F$66,3,FALSE),\"\")","v":""},null,null,null,{"$f":"UPPER(IF($A$2=\"R\",IF(OR(O54=1,O54=\"a\"),N53,IF(OR(O54=2,O54=\"b\"),N55,\"\")),IF(OR(O54=1,O54=\"a\"),N53,IF(OR(O54=2,O54=\"b\"),N55,\"\"))))","v":""}]
[51,{"$f":"38-D55+16","v":29},null,25,0,{"$f":"IF(NOT($G55=\"-\"),VLOOKUP($G55,DrawPrep!$A$3:$F$66,2,FALSE),\"\")","v":{"$error":"#N/A"}},{"$f":"VLOOKUP($B55,Setup!$K$2:$L$65,2,FALSE)","v":{"$error":"#N/A"}},{"$f":"IF($G55>0,VLOOKUP($G55,DrawPrep!$A$3:$F$66,6,FALSE),0)","v":{"$error":"#N/A"}},{"$f":"IF(Setup!$B$24=\"#\",0,IF($G55>0,VLOOKUP($G55,DrawPrep!$A$3:$F$66,3,FALSE),0))","v":{"$error":"#N/A"}},{"$f":"IF($I55>0,VLOOKUP($I55,DrawPrep!$C$3:$F$66,2,FALSE),\"bye\")","v":{"$error":"#N/A"}},{"$error":"#N/A"},{"$f":"IF($I55>0,VLOOKUP($I55,DrawPrep!$C$3:$F$66,3,FALSE),\"\")","v":{"$error":"#N/A"}},null,{"$f":"UPPER(IF($A$2=\"R\",IF(OR(M55=1,M55=\"a\"),I55,IF(OR(M55=2,M55=\"b\"),I56,\"\")),IF(OR(M55=1,M55=\"a\"),K55,IF(OR(M55=2,M55=\"b\"),K56,\"\"))))","v":""}]
[52,{"$f":"39-D56+16","v":29},22,26,{"$f":"IF($B$2>=C56,1,0)","v":1},{"$f":"IF(NOT($G56=\"-\"),VLOOKUP($G56,DrawPrep!$A$3:$F$66,2,FALSE),\"\")","v":""},{"$f":"IF($B$2>=C56,\"-\",VLOOKUP($B56,Setup!$K$2:$L$65,2,FALSE))","v":"-"},{"$f":"IF(NOT($G56=\"-\"),VLOOKUP($G56,DrawPrep!$A$3:$F$66,6,FALSE),0)","v":0},{"$f":"IF(Setup!$B$24=\"#\",0,IF(NOT($G56=\"-\"),VLOOKUP($G56,DrawPrep!$A$3:$F$66,3,FALSE),0))","v":0},{"$f":"IF($I56>0,VLOOKUP($I56,DrawPrep!$C$3:$F$66,2,FALSE),\"bye\")","v":"bye"},"",{"$f":"IF($I56>0,VLOOKUP($I56,DrawPrep!$C$3:$F$66,3,FALSE),\"\")","v":""},null,null,null,null,null,{"$f":"UPPER(IF($A$2=\"R\",IF(OR(Q56=1,Q56=\"a\"),P54,IF(OR(Q56=2,Q56=\"b\"),P58,\"\")),IF(OR(Q56=1,Q56=\"a\"),P54,IF(OR(Q56=2,Q56=\"b\"),P58,\"\"))))","v":""}]
[53,{"$f":"40-D57+16","v":30},null,26,0,{"$f":"IF(NOT($G57=\"-\"),VLOOKUP($G57,DrawPrep!$A$3:$F$66,2,FALSE),\"\")","v":{"$error":"#N/A"}},{"$f":"VLOOKUP($B57,Setup!$K$2:$L$65,2,FALSE)","v":{"$error":"#N/A"}},{"$f":"IF($G57>0,VLOOKUP($G57,DrawPrep!$A$3:$F$66,6,FALSE),0)","v":{"$error":"#N/A"}},{"$f":"IF(Setup!$B$24=\"#\",0,IF($G57>0,VLOOKUP($G57,DrawPrep!$A$3:$F$66,3,FALSE),0))","v":{"$error":"#N/A"}},{"$f":"IF($I57>0,VLOOKUP($I57,DrawPrep!$C$3:$F$66,2,FALSE),\"bye\")","v":{"$error":"#N/A"}},{"$error":"#N/A"},{"$f":"IF($I57>0,VLOOKUP($I57,DrawPrep!$C$3:$F$66,3,FALSE),\"\")","v":{"$error":"#N/A"}},null,{"$f":"UPPER(IF($A$2=\"R\",IF(OR(M57=1,M57=\"a\"),I57,IF(OR(M57=2,M57=\"b\"),I58,\"\")),IF(OR(M57=1,M57=\"a\"),K57,IF(OR(M57=2,M57=\"b\"),K58,\"\"))))","v":""}]
[54,{"$f":"41-D58+16","v":30},26,27,{"$f":"IF($B$2>=C58,1,0)","v":1},{"$f":"IF(NOT($G58=\"-\"),VLOOKUP($G58,DrawPrep!$A$3:$F$66,2,FALSE),\"\")","v":""},{"$f":"IF($B$2>=C58,\"-\",VLOOKUP($B58,Setup!$K$2:$L$65,2,FALSE))","v":"-"},{"$f":"IF(NOT($G58=\"-\"),VLOOKUP($G58,DrawPrep!$A$3:$F$66,6,FALSE),0)","v":0},{"$f":"IF(Setup!$B$24=\"#\",0,IF(NOT($G58=\"-\"),VLOOKUP($G58,DrawPrep!$A$3:$F$66,3,FALSE),0))","v":0},{"$f":"IF($I58>0,VLOOKUP($I58,DrawPrep!$C$3:$F$66,2,FALSE),\"bye\")","v":"bye"},"",{"$f":"IF($I58>0,VLOOKUP($I58,DrawPrep!$C$3:$F$66,3,FALSE),\"\")","v":""},null,null,null,{"$f":"UPPER(IF($A$2=\"R\",IF(OR(O58=1,O58=\"a\"),N57,IF(OR(O58=2,O58=\"b\"),N59,\"\")),IF(OR(O58=1,O58=\"a\"),N57,IF(OR(O58=2,O58=\"b\"),N59,\"\"))))","v":""}]
[55,{"$f":"42-D59+16","v":30},{"$f":"B60","v":9},28,{"$f":"IF($B$2>=C59,1,0)","v":1},{"$f":"IF(NOT($G59=\"-\"),VLOOKUP($G59,DrawPrep!$A$3:$F$66,2,FALSE),\"\")","v":""},{"$f":"IF($B$2>=C59,\"-\",VLOOKUP($B59,Setup!$K$2:$L$65,2,FALSE))","v":"-"},{"$f":"IF(NOT($G59=\"-\"),VLOOKUP($G59,DrawPrep!$A$3:$F$66,6,FALSE),0)","v":0},{"$f":"IF(Setup!$B$24=\"#\",0,IF(NOT($G59=\"-\"),VLOOKUP($G59,DrawPrep!$A$3:$F$66,3,FALSE),0))","v":0},{"$f":"IF($I59>0,VLOOKUP($I59,DrawPrep!$C$3:$F$66,2,FALSE),\"bye\")","v":"bye"},"",{"$f":"IF($I59>0,VLOOKUP($I59,DrawPrep!$C$3:$F$66,3,FALSE),\"\")","v":""},null,{"$f":"UPPER(IF($A$2=\"R\",IF(OR(M59=1,M59=\"a\"),I59,IF(OR(M59=2,M59=\"b\"),I60,\"\")),IF(OR(M59=1,M59=\"a\"),K59,IF(OR(M59=2,M59=\"b\"),K60,\"\"))))","v":""}]
[56,{"$f":"VALUE(Setup!E13)","v":9},null,28,0,{"$f":"IF(NOT($G60=\"-\"),VLOOKUP($G60,DrawPrep!$A$3:$F$66,2,FALSE),\"\")","v":0},{"$f":"VLOOKUP($B60,Setup!$K$2:$L$65,2,FALSE)","v":9},{"$f":"IF($G60>0,VLOOKUP($G60,DrawPrep!$A$3:$F$66,6,FALSE),0)","v":15},{"$f":"IF(Setup!$B$24=\"#\",0,IF($G60>0,VLOOKUP($G60,DrawPrep!$A$3:$F$66,3,FALSE),0))","v":37979},{"$f":"IF($I60>0,VLOOKUP($I60,DrawPrep!$C$3:$F$66,2,FALSE),\"bye\")","v":"ΧΑΤΖΟΠΟΥΛΟΣ ΒΑΣΙΛΕΙΟΣ"},"ΧΑΤΖΟΠΟΥΛΟΣ",{"$f":"IF($I60>0,VLOOKUP($I60,DrawPrep!$C$3:$F$66,3,FALSE),\"\")","v":"Α.Γ.Ο. ΦΙΛΙΠΠΙΑΔΑΣ"},null,null,null,null,null,null,null,{"$f":"UPPER(IF($A$2=\"R\",IF(OR(S60=1,S60=\"a\"),R56,IF(OR(S60=2,S60=\"b\"),R64,\"\")),IF(OR(S60=1,S60=\"a\"),R56,IF(OR(S60=2,S60=\"b\"),R64,\"\"))))","v":""}]
[57,{"$f":"VALUE(Setup!E18)","v":14},null,28,0,{"$f":"IF(NOT($G61=\"-\"),VLOOKUP($G61,DrawPrep!$A$3:$F$66,2,FALSE),\"\")","v":0},{"$f":"VLOOKUP($B61,Setup!$K$2:$L$65,2,FALSE)","v":14},{"$f":"IF($G61>0,VLOOKUP($G61,DrawPrep!$A$3:$F$66,6,FALSE),0)","v":10},{"$f":"IF(Setup!$B$24=\"#\",0,IF($G61>0,VLOOKUP($G61,DrawPrep!$A$3:$F$66,3,FALSE),0))","v":32430},{"$f":"IF($I61>0,VLOOKUP($I61,DrawPrep!$C$3:$F$66,2,FALSE),\"bye\")","v":"ΔΗΜΟΠΟΥΛΟΣ ΝΙΚΟΛΑΣ"},"ΔΗΜΟΠΟΥΛΟΣ",{"$f":"IF($I61>0,VLOOKUP($I61,DrawPrep!$C$3:$F$66,3,FALSE),\"\")","v":"Α.Ε.Τ. ΝΙΚΗ ΠΑΤΡΩΝ"},null,{"$f":"UPPER(IF($A$2=\"R\",IF(OR(M61=1,M61=\"a\"),I61,IF(OR(M61=2,M61=\"b\"),I62,\"\")),IF(OR(M61=1,M61=\"a\"),K61,IF(OR(M61=2,M61=\"b\"),K62,\"\"))))","v":""}]
[58,{"$f":"43-D62+16","v":30},{"$f":"B60","v":9},29,{"$f":"IF($B$2>=C62,1,0)","v":1},{"$f":"IF(NOT($G62=\"-\"),VLOOKUP($G62,DrawPrep!$A$3:$F$66,2,FALSE),\"\")","v":""},{"$f":"IF($B$2>=C62,\"-\",VLOOKUP($B62,Setup!$K$2:$L$65,2,FALSE))","v":"-"},{"$f":"IF(NOT($G62=\"-\"),VLOOKUP($G62,DrawPrep!$A$3:$F$66,6,FALSE),0)","v":0},{"$f":"IF(Setup!$B$24=\"#\",0,IF(NOT($G62=\"-\"),VLOOKUP($G62,DrawPrep!$A$3:$F$66,3,FALSE),0))","v":0},{"$f":"IF($I62>0,VLOOKUP($I62,DrawPrep!$C$3:$F$66,2,FALSE),\"bye\")","v":"bye"},"",{"$f":"IF($I62>0,VLOOKUP($I62,DrawPrep!$C$3:$F$66,3,FALSE),\"\")","v":""},null,null,null,{"$f":"UPPER(IF($A$2=\"R\",IF(OR(O62=1,O62=\"a\"),N61,IF(OR(O62=2,O62=\"b\"),N63,\"\")),IF(OR(O62=1,O62=\"a\"),N61,IF(OR(O62=2,O62=\"b\"),N63,\"\"))))","v":""}]
[59,{"$f":"44-D63+16","v":31},null,29,0,{"$f":"IF(NOT($G63=\"-\"),VLOOKUP($G63,DrawPrep!$A$3:$F$66,2,FALSE),\"\")","v":{"$error":"#N/A"}},{"$f":"VLOOKUP($B63,Setup!$K$2:$L$65,2,FALSE)","v":{"$error":"#N/A"}},{"$f":"IF($G63>0,VLOOKUP($G63,DrawPrep!$A$3:$F$66,6,FALSE),0)","v":{"$error":"#N/A"}},{"$f":"IF(Setup!$B$24=\"#\",0,IF($G63>0,VLOOKUP($G63,DrawPrep!$A$3:$F$66,3,FALSE),0))","v":{"$error":"#N/A"}},{"$f":"IF($I63>0,VLOOKUP($I63,DrawPrep!$C$3:$F$66,2,FALSE),\"bye\")","v":{"$error":"#N/A"}},{"$error":"#N/A"},{"$f":"IF($I63>0,VLOOKUP($I63,DrawPrep!$C$3:$F$66,3,FALSE),\"\")","v":{"$error":"#N/A"}},null,{"$f":"UPPER(IF($A$2=\"R\",IF(OR(M63=1,M63=\"a\"),I63,IF(OR(M63=2,M63=\"b\"),I64,\"\")),IF(OR(M63=1,M63=\"a\"),K63,IF(OR(M63=2,M63=\"b\"),K64,\"\"))))","v":""}]
[60,{"$f":"45-D64+16","v":31},18,30,{"$f":"IF($B$2>=C64,1,0)","v":1},{"$f":"IF(NOT($G64=\"-\"),VLOOKUP($G64,DrawPrep!$A$3:$F$66,2,FALSE),\"\")","v":""},{"$f":"IF($B$2>=C64,\"-\",VLOOKUP($B64,Setup!$K$2:$L$65,2,FALSE))","v":"-"},{"$f":"IF(NOT($G64=\"-\"),VLOOKUP($G64,DrawPrep!$A$3:$F$66,6,FALSE),0)","v":0},{"$f":"IF(Setup!$B$24=\"#\",0,IF(NOT($G64=\"-\"),VLOOKUP($G64,DrawPrep!$A$3:$F$66,3,FALSE),0))","v":0},{"$f":"IF($I64>0,VLOOKUP($I64,DrawPrep!$C$3:$F$66,2,FALSE),\"bye\")","v":"bye"},"",{"$f":"IF($I64>0,VLOOKUP($I64,DrawPrep!$C$3:$F$66,3,FALSE),\"\")","v":""},null,null,null,null,null,{"$f":"UPPER(IF($A$2=\"R\",IF(OR(Q64=1,Q64=\"a\"),P62,IF(OR(Q64=2,Q64=\"b\"),P66,\"\")),IF(OR(Q64=1,Q64=\"a\"),P62,IF(OR(Q64=2,Q64=\"b\"),P66,\"\"))))","v":""}]
[61,{"$f":"46-D65+16","v":32},null,30,0,{"$f":"IF(NOT($G65=\"-\"),VLOOKUP($G65,DrawPrep!$A$3:$F$66,2,FALSE),\"\")","v":{"$error":"#N/A"}},{"$f":"VLOOKUP($B65,Setup!$K$2:$L$65,2,FALSE)","v":{"$error":"#N/A"}},{"$f":"IF($G65>0,VLOOKUP($G65,DrawPrep!$A$3:$F$66,6,FALSE),0)","v":{"$error":"#N/A"}},{"$f":"IF(Setup!$B$24=\"#\",0,IF($G65>0,VLOOKUP($G65,DrawPrep!$A$3:$F$66,3,FALSE),0))","v":{"$error":"#N/A"}},{"$f":"IF($I65>0,VLOOKUP($I65,DrawPrep!$C$3:$F$66,2,FALSE),\"bye\")","v":{"$error":"#N/A"}},{"$error":"#N/A"},{"$f":"IF($I65>0,VLOOKUP($I65,DrawPrep!$C$3:$F$66,3,FALSE),\"\")","v":{"$error":"#N/A"}},null,{"$f":"UPPER(IF($A$2=\"R\",IF(OR(M65=1,M65=\"a\"),I65,IF(OR(M65=2,M65=\"b\"),I66,\"\")),IF(OR(M65=1,M65=\"a\"),K65,IF(OR(M65=2,M65=\"b\"),K66,\"\"))))","v":""}]
[62,{"$f":"47-D66+16","v":32},30,31,{"$f":"IF($B$2>=C66,1,0)","v":1},{"$f":"IF(NOT($G66=\"-\"),VLOOKUP($G66,DrawPrep!$A$3:$F$66,2,FALSE),\"\")","v":""},{"$f":"IF($B$2>=C66,\"-\",VLOOKUP($B66,Setup!$K$2:$L$65,2,FALSE))","v":"-"},{"$f":"IF(NOT($G66=\"-\"),VLOOKUP($G66,DrawPrep!$A$3:$F$66,6,FALSE),0)","v":0},{"$f":"IF(Setup!$B$24=\"#\",0,IF(NOT($G66=\"-\"),VLOOKUP($G66,DrawPrep!$A$3:$F$66,3,FALSE),0))","v":0},{"$f":"IF($I66>0,VLOOKUP($I66,DrawPrep!$C$3:$F$66,2,FALSE),\"bye\")","v":"bye"},"",{"$f":"IF($I66>0,VLOOKUP($I66,DrawPrep!$C$3:$F$66,3,FALSE),\"\")","v":""},null,null,null,{"$f":"UPPER(IF($A$2=\"R\",IF(OR(O66=1,O66=\"a\"),N65,IF(OR(O66=2,O66=\"b\"),N67,\"\")),IF(OR(O66=1,O66=\"a\"),N65,IF(OR(O66=2,O66=\"b\"),N67,\"\"))))","v":""}]
[63,{"$f":"48-D67+16","v":32},{"$f":"B68","v":2},32,{"$f":"IF($B$2>=C67,1,0)","v":1},{"$f":"IF(NOT($G67=\"-\"),VLOOKUP($G67,DrawPrep!$A$3:$F$66,2,FALSE),\"\")","v":""},{"$f":"IF($B$2>=C67,\"-\",VLOOKUP($B67,Setup!$K$2:$L$65,2,FALSE))","v":"-"},{"$f":"IF(NOT($G67=\"-\"),VLOOKUP($G67,DrawPrep!$A$3:$F$66,6,FALSE),0)","v":0},{"$f":"IF(Setup!$B$24=\"#\",0,IF(NOT($G67=\"-\"),VLOOKUP($G67,DrawPrep!$A$3:$F$66,3,FALSE),0))","v":0},{"$f":"IF($I67>0,VLOOKUP($I67,DrawPrep!$C$3:$F$66,2,FALSE),\"bye\")","v":"bye"},"",{"$f":"IF($I67>0,VLOOKUP($I67,DrawPrep!$C$3:$F$66,3,FALSE),\"\")","v":""},null,{"$f":"UPPER(IF($A$2=\"R\",IF(OR(M67=1,M67=\"a\"),I67,IF(OR(M67=2,M67=\"b\"),I68,\"\")),IF(OR(M67=1,M67=\"a\"),K67,IF(OR(M67=2,M67=\"b\"),K68,\"\"))))","v":""}]
[64,2,null,null,null,{"$f":"IF(NOT($G68=\"-\"),VLOOKUP($G68,DrawPrep!$A$3:$F$66,2,FALSE),\"\")","v":0},{"$f":"VLOOKUP($B68,Setup!$K$2:$L$65,2,FALSE)","v":2},{"$f":"IF($G68>0,VLOOKUP($G68,DrawPrep!$A$3:$F$66,6,FALSE),0)","v":22},{"$f":"IF(Setup!$B$24=\"#\",0,IF($G68>0,VLOOKUP($G68,DrawPrep!$A$3:$F$66,3,FALSE),0))","v":36852},{"$f":"IF($I68>0,VLOOKUP($I68,DrawPrep!$C$3:$F$66,2,FALSE),\"bye\")","v":"ΤΖΩΡΤΖΑΤΟΣ ΚΩΝΣΤΑΝΤΙΝΟΣ"},"ΤΖΩΡΤΖΑΤΟΣ",{"$f":"IF($I68>0,VLOOKUP($I68,DrawPrep!$C$3:$F$66,3,FALSE),\"\")","v":"ΑΟΑ ΠΑΤΡΩΝ"}]
[null,null,null,null,null,null,null,null,null,null,null,null,null," ",null," ",null," ",null," "]
[null,null,null,null,null,null,null,null,null,null,null,null,null,null,null,"seeded players"]
[null,null,null,null,null,null,null,null,null,null,null,null,null,null,null,{"$f":"\"01. \" & IF(Setup!B19>0,LEFT(DrawPrep!D3,FIND(\" \",DrawPrep!D3)+1),\"\")","v":"01. ΙΑΚΩΒΑΚΗΣ Ε"},null,{"$f":"\"09. \" & IF(Setup!B19>8,LEFT(DrawPrep!D11,FIND(\" \",DrawPrep!D11)+1),\"\")","v":"09. ΧΑΤΖΟΠΟΥΛΟΣ Β"}]
[null,null,null,null,null,null,null,null,null,null,null,null,null,null,null,{"$f":"\"02. \" & IF(Setup!B19>1,LEFT(DrawPrep!D4,FIND(\" \",DrawPrep!D4)+1),\"\")","v":"02. ΤΖΩΡΤΖΑΤΟΣ Κ"},null,{"$f":"\"10. \" & IF(Setup!B19>9,LEFT(DrawPrep!D12,FIND(\" \",DrawPrep!D12)+1),\"\")","v":"10. ΑΦΑΛΩΝΙΑΤΗΣ Θ"}]
[null,null,null,null,null,null,null,null,null,null,null,null,null,null,null,{"$f":"\"03. \" & IF(Setup!B19>2,LEFT(DrawPrep!D5,FIND(\" \",DrawPrep!D5)+1),\"\")","v":"03. ΛΑΜΠΡΟΠΟΥΛΟΣ Μ"},null,{"$f":"\"11. \" & IF(Setup!B19>10,LEFT(DrawPrep!D13,FIND(\" \",DrawPrep!D13)+1),\"\")","v":"11. ΚΑΤΑΠΟΔΗΣ Γ"}]
[null,null,null,null,null,null,null,null,null,null,null,null,null,null,null,{"$f":"\"04. \" & IF(Setup!B19>3,LEFT(DrawPrep!D6,FIND(\" \",DrawPrep!D6)+1),\"\")","v":"04. ΓΟΥΔΕΛΗΣ Δ"},null,{"$f":"\"12. \" & IF(Setup!B19>11,LEFT(DrawPrep!D14,FIND(\" \",DrawPrep!D14)+1),\"\")","v":"12. ΜΟΣΧΟΒΙΝΟΣ Α"}]
[null,null,null,null,null,null,null,null,null,null,null,null,null,null,null,{"$f":"\"05. \" & IF(Setup!B19>4,LEFT(DrawPrep!D7,FIND(\" \",DrawPrep!D7)+1),\"\")","v":"05. ΡΟΖΗΣ Δ"},null,{"$f":"\"13. \" & IF(Setup!B19>12,LEFT(DrawPrep!D15,FIND(\" \",DrawPrep!D15)+1),\"\")","v":"13. ΛΑΜΠΡΟΠΟΥΛΟΣ Α"}]
[null,null,null,null,null,null,null,null,null,null,null,null,null,null,null,{"$f":"\"06. \" & IF(Setup!B19>5,LEFT(DrawPrep!D8,FIND(\" \",DrawPrep!D8)+1),\"\")","v":"06. ΓΙΑΝΝΟΣ Η"},null,{"$f":"\"14. \" & IF(Setup!B19>13,LEFT(DrawPrep!D16,FIND(\" \",DrawPrep!D16)+1),\"\")","v":"14. ΔΗΜΟΠΟΥΛΟΣ Ν"}]
[null,null,null,null,null,null,null,null,null,null,null,null,null,null,null,{"$f":"\"07. \" & IF(Setup!B19>6,LEFT(DrawPrep!D9,FIND(\" \",DrawPrep!D9)+1),\"\")","v":"07. ΝΙΚΟΛΑΟΥ Α"},null,{"$f":"\"15. \" & IF(Setup!B19>14,LEFT(DrawPrep!D17,FIND(\" \",DrawPrep!D17)+1),\"\")","v":"15. ΔΗΜΗΤΡΙΟΥ Γ"}]
[null,null,null,null,null,null,null,null,null,null,null,null,null,null,null,{"$f":"\"08. \" & IF(Setup!B19>7,LEFT(DrawPrep!D10,FIND(\" \",DrawPrep!D10)+1),\"\")","v":"08. ΚΑΡΑΟΥΛΑΝΗΣ Β"},null,{"$f":"\"16. \" & IF(Setup!B19>15,LEFT(DrawPrep!D18,FIND(\" \",DrawPrep!D18)+1),\"\")","v":"16. ΚΑΥΜΕΝΑΚΗΣ Α"}]
[]
[null,null,null,null,null,null,null,null,null,null,null,null,null,null,null,"επιδιαιτητής"]
[null,null,null,null,null,null,null,null,null,null,null,null,null,null,null,{"$f":"Setup!B10","v":"Στέφος Αλέξης"}]
[]
[]
[]
[]
[]
[]
[]
[]
[null,null,null,null,null,null,null,null,null,"BoldPlayers"]
[null,null,null,null,null,null,null,null,null,{"$f":"IF(Setup!$B$19>0,LEFT(DrawPrep!D3,FIND(\" \",DrawPrep!D3)-1))","v":"ΙΑΚΩΒΑΚΗΣ"}]
[null,null,null,null,null,null,null,null,null,{"$f":"IF(Setup!$B$19>1,LEFT(DrawPrep!D4,FIND(\" \",DrawPrep!D4)-1))","v":"ΤΖΩΡΤΖΑΤΟΣ"}]
[null,null,null,null,null,null,null,null,null,{"$f":"IF(Setup!$B$19>2,LEFT(DrawPrep!D5,FIND(\" \",DrawPrep!D5)-1))","v":"ΛΑΜΠΡΟΠΟΥΛΟΣ"}]
[null,null,null,null,null,null,null,null,null,{"$f":"IF(Setup!$B$19>3,LEFT(DrawPrep!D6,FIND(\" \",DrawPrep!D6)-1))","v":"ΓΟΥΔΕΛΗΣ"}]
[null,null,null,null,null,null,null,null,null,{"$f":"IF(Setup!$B$19>4,LEFT(DrawPrep!D7,FIND(\" \",DrawPrep!D7)-1))","v":"ΡΟΖΗΣ"}]
[null,null,null,null,null,null,null,null,null,{"$f":"IF(Setup!$B$19>5,LEFT(DrawPrep!D8,FIND(\" \",DrawPrep!D8)-1))","v":"ΓΙΑΝΝΟΣ"}]
[null,null,null,null,null,null,null,null,null,{"$f":"IF(Setup!$B$19>6,LEFT(DrawPrep!D9,FIND(\" \",DrawPrep!D9)-1))","v":"ΝΙΚΟΛΑΟΥ"}]
[null,null,null,null,null,null,null,null,null,{"$f":"IF(Setup!$B$19>7,LEFT(DrawPrep!D10,FIND(\" \",DrawPrep!D10)-1))","v":"ΚΑΡΑΟΥΛΑΝΗΣ"}]
[null,null,null,null,null,null,null,null,null,{"$f":"IF(Setup!$B$19>8,LEFT(DrawPrep!D11,FIND(\" \",DrawPrep!D11)-1))","v":"ΧΑΤΖΟΠΟΥΛΟΣ"}]
[null,null,null,null,null,null,null,null,null,{"$f":"IF(Setup!$B$19>9,LEFT(DrawPrep!D12,FIND(\" \",DrawPrep!D12)-1))","v":"ΑΦΑΛΩΝΙΑΤΗΣ"}]
[null,null,null,null,null,null,null,null,null,{"$f":"IF(Setup!$B$19>10,LEFT(DrawPrep!D13,FIND(\" \",DrawPrep!D13)-1))","v":"ΚΑΤΑΠΟΔΗΣ"}]
[null,null,null,null,null,null,null,null,null,{"$f":"IF(Setup!$B$19>11,LEFT(DrawPrep!D14,FIND(\" \",DrawPrep!D14)-1))","v":"ΜΟΣΧΟΒΙΝΟΣ"}]
[null,null,null,null,null,null,null,null,null,{"$f":"IF(Setup!$B$19>12,LEFT(DrawPrep!D15,FIND(\" \",DrawPrep!D15)-1))","v":"ΛΑΜΠΡΟΠΟΥΛΟΣ"}]
[null,null,null,null,null,null,null,null,null,{"$f":"IF(Setup!$B$19>13,LEFT(DrawPrep!D16,FIND(\" \",DrawPrep!D16)-1))","v":"ΔΗΜΟΠΟΥΛΟΣ"}]
[null,null,null,null,null,null,null,null,null,{"$f":"IF(Setup!$B$19>14,LEFT(DrawPrep!D17,FIND(\" \",DrawPrep!D17)-1))","v":"ΔΗΜΗΤΡΙΟΥ"}]
[null,null,null,null,null,null,null,null,null,{"$f":"IF(Setup!$B$19>15,LEFT(DrawPrep!D18,FIND(\" \",DrawPrep!D18)-1))","v":"ΚΑΥΜΕΝΑΚΗΣ"}]

{"sheet":"PrgPrep","index":3,"n_rows":82,"n_cols":7,"rows_kept":82,"cut":false,"hidden":false,"merged":[[0,0,0,5],[1,0,1,5],[74,5,75,5],[2,5,3,5],[37,5,38,5],[67,5,68,5],[56,5,57,5]]}
[{"$f":"Setup!B3 & \", \" & Setup!B4 & \", \" & Setup!B6  & \" (\" & Setup!B7 & \")\"","v":"ΕΦΟΑ, ΠΑΝΕΛΛΑΔΙΚΟ U10, ΑΕΤ ΝΙΚΗ ΠΑΤΡΩΝ (A-A C)"}]
[{"$f":"Setup!$B$10","v":"Στέφος Αλέξης"}]
["Πρόγραμμα αγώνων",null,null,null,"Round 1","i"," Don't change this Worksheet !"]
["ΩΡΑ","Κτγρ.","Αθλητής-Σύλλογος",null,"Αθλητής-Σύλλογος"]
["Έναρξη",{"$f":"Setup!$B$7","v":"A-A C"},{"$f":"IF(OR(Draw!J5=\"bye\",Draw!J5=\"LWD\"), \"\",CONCATENATE(LEFT(Draw!J5,FIND(\" \",Draw!J5)+1),\" (\",Draw!L5,\")\"))","v":"ΙΑΚΩΒΑΚΗΣ Ε (Ο.Α. ΦΟΙΒΟΣ ΛΑΡΙΣΑΣ)"},{"$f":"IF(OR(C5=\"\",E5=\"\"),\" \",\"-\")","v":" "},{"$f":"IF(OR(Draw!J6=\"bye\",Draw!J6=\"LWD\"), \"\",CONCATENATE(LEFT(Draw!J6,FIND(\" \",Draw!J6)+1),\" (\",Draw!L6,\")\"))","v":""}]
[null,{"$f":"Setup!$B$7","v":"A-A C"},{"$f":"IF(OR(Draw!J7=\"bye\",Draw!J7=\"LWD\"), \"\",CONCATENATE(LEFT(Draw!J7,FIND(\" \",Draw!J7)+1),\" (\",Draw!L7,\")\"))","v":"ΤΖΙΤΖΙΜΙΚΑΣ Γ (Α.Ο. ΚΟΛΕΓΙΟΥ ΝΤΕΡΗ)"},{"$f":"IF(OR(C6=\"\",E6=\"\"),\" \",\"-\")","v":" "},{"$f":"IF(OR(Draw!J8=\"bye\",Draw!J8=\"LWD\"), \"\",CONCATENATE(LEFT(Draw!J8,FIND(\" \",Draw!J8)+1),\" (\",Draw!L8,\")\"))","v":""}]
[null,{"$f":"Setup!$B$7","v":"A-A C"},{"$f":"IF(OR(Draw!J9=\"bye\",Draw!J9=\"LWD\"), \"\",CONCATENATE(LEFT(Draw!J9,FIND(\" \",Draw!J9)+1),\" (\",Draw!L9,\")\"))","v":"ΨΑΡΑΚΗΣ Γ (ΚΙΑΤΟ)"}," ",{"$f":"IF(OR(Draw!J10=\"bye\",Draw!J10=\"LWD\"), \"\",CONCATENATE(LEFT(Draw!J10,FIND(\" \",Draw!J10)+1),\" (\",Draw!L10,\")\"))","v":""}]
[null,{"$f":"Setup!$B$7","v":"A-A C"},{"$f":"IF(OR(Draw!J11=\"bye\",Draw!J11=\"LWD\"), \"\",CONCATENATE(LEFT(Draw!J11,FIND(\" \",Draw!J11)+1),\" (\",Draw!L11,\")\"))","v":""}," ",{"$f":"IF(OR(Draw!J12=\"bye\",Draw!J12=\"LWD\"), \"\",CONCATENATE(LEFT(Draw!J12,FIND(\" \",Draw!J12)+1),\" (\",Draw!L12,\")\"))","v":"ΛΑΜΠΡΟΠΟΥΛΟΣ Α (ΑΕΚ ΤΡΙΠΟΛΗΣ)"}]
[null,{"$f":"Setup!$B$7","v":"A-A C"},{"$f":"IF(OR(Draw!J13=\"bye\",Draw!J13=\"LWD\"), \"\",CONCATENATE(LEFT(Draw!J13,FIND(\" \",Draw!J13)+1),\" (\",Draw!L13,\")\"))","v":"ΜΟΣΧΟΒΙΝΟΣ Α (Α.Σ. ΑΣΤΕΡΑΣ ΠΕΝΤΕΛΙΚΟΥ)"}," ",{"$f":"IF(OR(Draw!J14=\"bye\",Draw!J14=\"LWD\"), \"\",CONCATENATE(LEFT(Draw!J14,FIND(\" \",Draw!J14)+1),\" (\",Draw!L14,\")\"))","v":""}]
["όχι πριν",{"$f":"Setup!$B$7","v":"A-A C"},{"$f":"IF(OR(Draw!J15=\"bye\",Draw!J15=\"LWD\"), \"\",CONCATENATE(LEFT(Draw!J15,FIND(\" \",Draw!J15)+1),\" (\",Draw!L15,\")\"))","v":"ΔΑΝΙΗΛΟΓΛΟΥ Γ (Ο.Α. ΓΟΥΔΗ)"}," ",{"$f":"IF(OR(Draw!J16=\"bye\",Draw!J16=\"LWD\"), \"\",CONCATENATE(LEFT(Draw!J16,FIND(\" \",Draw!J16)+1),\" (\",Draw!L16,\")\"))","v":""}]
[null,{"$f":"Setup!$B$7","v":"A-A C"},{"$f":"IF(OR(Draw!J17=\"bye\",Draw!J17=\"LWD\"), \"\",CONCATENATE(LEFT(Draw!J17,FIND(\" \",Draw!J17)+1),\" (\",Draw!L17,\")\"))","v":"ΓΙΑΝΝΑΚΟΠΟΥΛΟΣ Δ (Α. Σ. ΚΟΛΛΕΓΙΟΥ ΝΤΕΡΗ)"}," ",{"$f":"IF(OR(Draw!J18=\"bye\",Draw!J18=\"LWD\"), \"\",CONCATENATE(LEFT(Draw!J18,FIND(\" \",Draw!J18)+1),\" (\",Draw!L18,\")\"))","v":""}]
[null,{"$f":"Setup!$B$7","v":"A-A C"},{"$f":"IF(OR(Draw!J19=\"bye\",Draw!J19=\"LWD\"), \"\",CONCATENATE(LEFT(Draw!J19,FIND(\" \",Draw!J19)+1),\" (\",Draw!L19,\")\"))","v":""}," ",{"$f":"IF(OR(Draw!J20=\"bye\",Draw!J20=\"LWD\"), \"\",CONCATENATE(LEFT(Draw!J20,FIND(\" \",Draw!J20)+1),\" (\",Draw!L20,\")\"))","v":"ΝΙΚΟΛΑΟΥ Α (Α.Ε.Τ. ΝΙΚΗ ΠΑΤΡΩΝ)"}]
[null,{"$f":"Setup!$B$7","v":"A-A C"},{"$f":"IF(OR(Draw!J21=\"bye\",Draw!J21=\"LWD\"), \"\",CONCATENATE(LEFT(Draw!J21,FIND(\" \",Draw!J21)+1),\" (\",Draw!L21,\")\"))","v":"ΛΑΜΠΡΟΠΟΥΛΟΣ Μ (ΑΕΚ ΤΡΙΠΟΛΗΣ)"}," ",{"$f":"IF(OR(Draw!J22=\"bye\",Draw!J22=\"LWD\"), \"\",CONCATENATE(LEFT(Draw!J22,FIND(\" \",Draw!J22)+1),\" (\",Draw!L22,\")\"))","v":""}]
[null,{"$f":"Setup!$B$7","v":"A-A C"},{"$f":"IF(OR(Draw!J23=\"bye\",Draw!J23=\"LWD\"), \"\",CONCATENATE(LEFT(Draw!J23,FIND(\" \",Draw!J23)+1),\" (\",Draw!L23,\")\"))","v":"ΜΕΓΑΛΟΓΙΑΝΝΗΣ Κ (ΑΙΟΛΟΣ ΑΘΛ. ΛΕΣΧΗ ΙΛΙΟΥ)"}," ",{"$f":"IF(OR(Draw!J24=\"bye\",Draw!J24=\"LWD\"), \"\",CONCATENATE(LEFT(Draw!J24,FIND(\" \",Draw!J24)+1),\" (\",Draw!L24,\")\"))","v":""}]
["όχι πριν",{"$f":"Setup!$B$7","v":"A-A C"},{"$f":"IF(OR(Draw!J25=\"bye\",Draw!J25=\"LWD\"), \"\",CONCATENATE(LEFT(Draw!J25,FIND(\" \",Draw!J25)+1),\" (\",Draw!L25,\")\"))","v":"ΜΠΟΝΙΚΟΣ Σ (ΖΑΚΥΝΘΙΝΟΣ Α.Ο.Α.)"}," ",{"$f":"IF(OR(Draw!J26=\"bye\",Draw!J26=\"LWD\"), \"\",CONCATENATE(LEFT(Draw!J26,FIND(\" \",Draw!J26)+1),\" (\",Draw!L26,\")\"))","v":""}]
[null,{"$f":"Setup!$B$7","v":"A-A C"},{"$f":"IF(OR(Draw!J27=\"bye\",Draw!J27=\"LWD\"), \"\",CONCATENATE(LEFT(Draw!J27,FIND(\" \",Draw!J27)+1),\" (\",Draw!L27,\")\"))","v":""}," ",{"$f":"IF(OR(Draw!J28=\"bye\",Draw!J28=\"LWD\"), \"\",CONCATENATE(LEFT(Draw!J28,FIND(\" \",Draw!J28)+1),\" (\",Draw!L28,\")\"))","v":"ΔΗΜΗΤΡΙΟΥ Γ (ΑΟΑ ΠΑΠΑΓΟΥ)"}]
[null,{"$f":"Setup!$B$7","v":"A-A C"},{"$f":"IF(OR(Draw!J29=\"bye\",Draw!J29=\"LWD\"), \"\",CONCATENATE(LEFT(Draw!J29,FIND(\" \",Draw!J29)+1),\" (\",Draw!L29,\")\"))","v":"ΚΑΤΑΠΟΔΗΣ Γ (ΑΟΑ ΠΑΤΡΩΝ)"}," ",{"$f":"IF(OR(Draw!J30=\"bye\",Draw!J30=\"LWD\"), \"\",CONCATENATE(LEFT(Draw!J30,FIND(\" \",Draw!J30)+1),\" (\",Draw!L30,\")\"))","v":""}]
[null,{"$f":"Setup!$B$7","v":"A-A C"},{"$f":"IF(OR(Draw!J31=\"bye\",Draw!J31=\"LWD\"), \"\",CONCATENATE(LEFT(Draw!J31,FIND(\" \",Draw!J31)+1),\" (\",Draw!L31,\")\"))","v":{"$error":"#N/A"}},{"$error":"#N/A"},{"$f":"IF(OR(Draw!J32=\"bye\",Draw!J32=\"LWD\"), \"\",CONCATENATE(LEFT(Draw!J32,FIND(\" \",Draw!J32)+1),\" (\",Draw!L32,\")\"))","v":""}]
[null,{"$f":"Setup!$B$7","v":"A-A C"},{"$f":"IF(OR(Draw!J33=\"bye\",Draw!J33=\"LWD\"), \"\",CONCATENATE(LEFT(Draw!J33,FIND(\" \",Draw!J33)+1),\" (\",Draw!L33,\")\"))","v":{"$error":"#N/A"}},{"$error":"#N/A"},{"$f":"IF(OR(Draw!J34=\"bye\",Draw!J34=\"LWD\"), \"\",CONCATENATE(LEFT(Draw!J34,FIND(\" \",Draw!J34)+1),\" (\",Draw!L34,\")\"))","v":""}]
["όχι πριν",{"$f":"Setup!$B$7","v":"A-A C"},{"$f":"IF(OR(Draw!J35=\"bye\",Draw!J35=\"LWD\"), \"\",CONCATENATE(LEFT(Draw!J35,FIND(\" \",Draw!J35)+1),\" (\",Draw!L35,\")\"))","v":""}," ",{"$f":"IF(OR(Draw!J36=\"bye\",Draw!J36=\"LWD\"), \"\",CONCATENATE(LEFT(Draw!J36,FIND(\" \",Draw!J36)+1),\" (\",Draw!L36,\")\"))","v":"ΡΟΖΗΣ Δ (Α.Ε.Τ. ΝΙΚΗ ΠΑΤΡΩΝ)"}]
[null,{"$f":"Setup!$B$7","v":"A-A C"},{"$f":"IF(OR(Draw!J37=\"bye\",Draw!J37=\"LWD\"), \"\",CONCATENATE(LEFT(Draw!J37,FIND(\" \",Draw!J37)+1),\" (\",Draw!L37,\")\"))","v":"ΚΑΡΑΟΥΛΑΝΗΣ Β (Ο.Α. ΦΟΙΒΟΣ ΛΑΡΙΣΑΣ)"}," ",{"$f":"IF(OR(Draw!J38=\"bye\",Draw!J38=\"LWD\"), \"\",CONCATENATE(LEFT(Draw!J38,FIND(\" \",Draw!J38)+1),\" (\",Draw!L38,\")\"))","v":""}]
[null,{"$f":"Setup!$B$7","v":"A-A C"},{"$f":"IF(OR(Draw!J39=\"bye\",Draw!J39=\"LWD\"), \"\",CONCATENATE(LEFT(Draw!J39,FIND(\" \",Draw!J39)+1),\" (\",Draw!L39,\")\"))","v":{"$error":"#N/A"}},{"$error":"#N/A"},{"$f":"IF(OR(Draw!J40=\"bye\",Draw!J40=\"LWD\"), \"\",CONCATENATE(LEFT(Draw!J40,FIND(\" \",Draw!J40)+1),\" (\",Draw!L40,\")\"))","v":""}]
[null,{"$f":"Setup!$B$7","v":"A-A C"},{"$f":"IF(OR(Draw!J41=\"bye\",Draw!J41=\"LWD\"), \"\",CONCATENATE(LEFT(Draw!J41,FIND(\" \",Draw!J41)+1),\" (\",Draw!L41,\")\"))","v":{"$error":"#N/A"}},{"$error":"#N/A"},{"$f":"IF(OR(Draw!J42=\"bye\",Draw!J42=\"LWD\"), \"\",CONCATENATE(LEFT(Draw!J42,FIND(\" \",Draw!J42)+1),\" (\",Draw!L42,\")\"))","v":""}]
[null,{"$f":"Setup!$B$7","v":"A-A C"},{"$f":"IF(OR(Draw!J43=\"bye\",Draw!J43=\"LWD\"), \"\",CONCATENATE(LEFT(Draw!J43,FIND(\" \",Draw!J43)+1),\" (\",Draw!L43,\")\"))","v":""}," ",{"$f":"IF(OR(Draw!J44=\"bye\",Draw!J44=\"LWD\"), \"\",CONCATENATE(LEFT(Draw!J44,FIND(\" \",Draw!J44)+1),\" (\",Draw!L44,\")\"))","v":"ΑΦΑΛΩΝΙΑΤΗΣ Θ (Α.Ε.Τ. ΝΙΚΗ ΠΑΤΡΩΝ)"}]
["όχι πριν",{"$f":"Setup!$B$7","v":"A-A C"},{"$f":"IF(OR(Draw!J45=\"bye\",Draw!J45=\"LWD\"), \"\",CONCATENATE(LEFT(Draw!J45,FIND(\" \",Draw!J45)+1),\" (\",Draw!L45,\")\"))","v":"ΚΑΥΜΕΝΑΚΗΣ Α (Ο.Α. ΧΑΝΙΩΝ)"}," ",{"$f":"IF(OR(Draw!J46=\"bye\",Draw!J46=\"LWD\"), \"\",CONCATENATE(LEFT(Draw!J46,FIND(\" \",Draw!J46)+1),\" (\",Draw!L46,\")\"))","v":""}]
[null,{"$f":"Setup!$B$7","v":"A-A C"},{"$f":"IF(OR(Draw!J47=\"bye\",Draw!J47=\"LWD\"), \"\",CONCATENATE(LEFT(Draw!J47,FIND(\" \",Draw!J47)+1),\" (\",Draw!L47,\")\"))","v":{"$error":"#N/A"}},{"$error":"#N/A"},{"$f":"IF(OR(Draw!J48=\"bye\",Draw!J48=\"LWD\"), \"\",CONCATENATE(LEFT(Draw!J48,FIND(\" \",Draw!J48)+1),\" (\",Draw!L48,\")\"))","v":""}]
[null,{"$f":"Setup!$B$7","v":"A-A C"},{"$f":"IF(OR(Draw!J49=\"bye\",Draw!J49=\"LWD\"), \"\",CONCATENATE(LEFT(Draw!J49,FIND(\" \",Draw!J49)+1),\" (\",Draw!L49,\")\"))","v":{"$error":"#N/A"}},{"$error":"#N/A"},{"$f":"IF(OR(Draw!J50=\"bye\",Draw!J50=\"LWD\"), \"\",CONCATENATE(LEFT(Draw!J50,FIND(\" \",Draw!J50)+1),\" (\",Draw!L50,\")\"))","v":""}]
[null,{"$f":"Setup!$B$7","v":"A-A C"},{"$f":"IF(OR(Draw!J51=\"bye\",Draw!J51=\"LWD\"), \"\",CONCATENATE(LEFT(Draw!J51,FIND(\" \",Draw!J51)+1),\" (\",Draw!L51,\")\"))","v":""}," ",{"$f":"IF(OR(Draw!J52=\"bye\",Draw!J52=\"LWD\"), \"\",CONCATENATE(LEFT(Draw!J52,FIND(\" \",Draw!J52)+1),\" (\",Draw!L52,\")\"))","v":"ΓΟΥΔΕΛΗΣ Δ (Α.Σ. ΑΣΤΕΡΑΣ ΠΕΝΤΕΛΙΚΟΥ)"}]
[null,{"$f":"Setup!$B$7","v":"A-A C"},{"$f":"IF(OR(Draw!J53=\"bye\",Draw!J53=\"LWD\"), \"\",CONCATENATE(LEFT(Draw!J53,FIND(\" \",Draw!J53)+1),\" (\",Draw!L53,\")\"))","v":"ΓΙΑΝΝΟΣ Η (Α.Γ.Ο. ΦΙΛΙΠΠΙΑΔΑΣ)"}," ",{"$f":"IF(OR(Draw!J54=\"bye\",Draw!J54=\"LWD\"), \"\",CONCATENATE(LEFT(Draw!J54,FIND(\" \",Draw!J54)+1),\" (\",Draw!L54,\")\"))","v":""}]
["όχι πριν",{"$f":"Setup!$B$7","v":"A-A C"},{"$f":"IF(OR(Draw!J55=\"bye\",Draw!J55=\"LWD\"), \"\",CONCATENATE(LEFT(Draw!J55,FIND(\" \",Draw!J55)+1),\" (\",Draw!L55,\")\"))","v":{"$error":"#N/A"}},{"$error":"#N/A"},{"$f":"IF(OR(Draw!J56=\"bye\",Draw!J56=\"LWD\"), \"\",CONCATENATE(LEFT(Draw!J56,FIND(\" \",Draw!J56)+1),\" (\",Draw!L56,\")\"))","v":""}]
[null,{"$f":"Setup!$B$7","v":"A-A C"},{"$f":"IF(OR(Draw!J57=\"bye\",Draw!J57=\"LWD\"), \"\",CONCATENATE(LEFT(Draw!J57,FIND(\" \",Draw!J57)+1),\" (\",Draw!L57,\")\"))","v":{"$error":"#N/A"}},{"$error":"#N/A"},{"$f":"IF(OR(Draw!J58=\"bye\",Draw!J58=\"LWD\"), \"\",CONCATENATE(LEFT(Draw!J58,FIND(\" \",Draw!J58)+1),\" (\",Draw!L58,\")\"))","v":""}]
[null,{"$f":"Setup!$B$7","v":"A-A C"},{"$f":"IF(OR(Draw!J59=\"bye\",Draw!J59=\"LWD\"), \"\",CONCATENATE(LEFT(Draw!J59,FIND(\" \",Draw!J59)+1),\" (\",Draw!L59,\")\"))","v":""}," ",{"$f":"IF(OR(Draw!J60=\"bye\",Draw!J60=\"LWD\"), \"\",CONCATENATE(LEFT(Draw!J60,FIND(\" \",Draw!J60)+1),\" (\",Draw!L60,\")\"))","v":"ΧΑΤΖΟΠΟΥΛΟΣ Β (Α.Γ.Ο. ΦΙΛΙΠΠΙΑΔΑΣ)"}]
[null,{"$f":"Setup!$B$7","v":"A-A C"},{"$f":"IF(OR(Draw!J61=\"bye\",Draw!J61=\"LWD\"), \"\",CONCATENATE(LEFT(Draw!J61,FIND(\" \",Draw!J61)+1),\" (\",Draw!L61,\")\"))","v":"ΔΗΜΟΠΟΥΛΟΣ Ν (Α.Ε.Τ. ΝΙΚΗ ΠΑΤΡΩΝ)"}," ",{"$f":"IF(OR(Draw!J62=\"bye\",Draw!J62=\"LWD\"), \"\",CONCATENATE(LEFT(Draw!J62,FIND(\" \",Draw!J62)+1),\" (\",Draw!L62,\")\"))","v":""}]
[null,{"$f":"Setup!$B$7","v":"A-A C"},{"$f":"IF(OR(Draw!J63=\"bye\",Draw!J63=\"LWD\"), \"\",CONCATENATE(LEFT(Draw!J63,FIND(\" \",Draw!J63)+1),\" (\",Draw!L63,\")\"))","v":{"$error":"#N/A"}},{"$error":"#N/A"},{"$f":"IF(OR(Draw!J64=\"bye\",Draw!J64=\"LWD\"), \"\",CONCATENATE(LEFT(Draw!J64,FIND(\" \",Draw!J64)+1),\" (\",Draw!L64,\")\"))","v":""}]
[null,{"$f":"Setup!$B$7","v":"A-A C"},{"$f":"IF(OR(Draw!J65=\"bye\",Draw!J65=\"LWD\"), \"\",CONCATENATE(LEFT(Draw!J65,FIND(\" \",Draw!J65)+1),\" (\",Draw!L65,\")\"))","v":{"$error":"#N/A"}},{"$error":"#N/A"},{"$f":"IF(OR(Draw!J66=\"bye\",Draw!J66=\"LWD\"), \"\",CONCATENATE(LEFT(Draw!J66,FIND(\" \",Draw!J66)+1),\" (\",Draw!L66,\")\"))","v":""}]
[null,{"$f":"Setup!$B$7","v":"A-A C"},{"$f":"IF(OR(Draw!J67=\"bye\",Draw!J67=\"LWD\"), \"\",CONCATENATE(LEFT(Draw!J67,FIND(\" \",Draw!J67)+1),\" (\",Draw!L67,\")\"))","v":""}," ",{"$f":"IF(OR(Draw!J68=\"bye\",Draw!J68=\"LWD\"), \"\",CONCATENATE(LEFT(Draw!J68,FIND(\" \",Draw!J68)+1),\" (\",Draw!L68,\")\"))","v":"ΤΖΩΡΤΖΑΤΟΣ Κ (ΑΟΑ ΠΑΤΡΩΝ)"}]
[]
["Πρόγραμμα αγώνων",null,null,null,"Round 2","i"," Don't change this Worksheet !"]
["ΩΡΑ","Κτγρ.","Αθλητής-Σύλλογος",null,"Αθλητής-Σύλλογος"]
["Έναρξη",{"$f":"Setup!$B$7","v":"A-A C"},{"$f":"IF(Draw!M5=\"\", \"\", IF(Draw!M5=1, CONCATENATE(LEFT(Draw!J5,FIND(\" \",Draw!J5)+1),\" (\",Draw!L5,\")\"),CONCATENATE(LEFT(Draw!J6,FIND(\" \",Draw!J6)+1),\" (\",Draw!L6,\")\")))","v":""},{"$f":"IF(OR(C40=\"\",E40=\"\"),\" \",\"-\")","v":" "},{"$f":"IF(Draw!M7=\"\", \"\", IF(Draw!M7=1, CONCATENATE(LEFT(Draw!J7,FIND(\" \",Draw!J7)+1),\" (\",Draw!L7,\")\"),CONCATENATE(LEFT(Draw!J8,FIND(\" \",Draw!J8)+1),\" (\",Draw!L8,\")\")))","v":""}]
[null,{"$f":"Setup!$B$7","v":"A-A C"},{"$f":"IF(Draw!M9=\"\", \"\", IF(Draw!M9=1, CONCATENATE(LEFT(Draw!J9,FIND(\" \",Draw!J9)+1),\" (\",Draw!L9,\")\"),CONCATENATE(LEFT(Draw!J10,FIND(\" \",Draw!J10)+1),\" (\",Draw!L10,\")\")))","v":""}," ",{"$f":"IF(Draw!M11=\"\", \"\", IF(Draw!M11=1, CONCATENATE(LEFT(Draw!J11,FIND(\" \",Draw!J11)+1),\" (\",Draw!L11,\")\"),CONCATENATE(LEFT(Draw!J12,FIND(\" \",Draw!J12)+1),\" (\",Draw!L12,\")\")))","v":""}]
[null,{"$f":"Setup!$B$7","v":"A-A C"},{"$f":"IF(Draw!M13=\"\", \"\", IF(Draw!M13=1, CONCATENATE(LEFT(Draw!J13,FIND(\" \",Draw!J13)+1),\" (\",Draw!L13,\")\"),CONCATENATE(LEFT(Draw!J14,FIND(\" \",Draw!J14)+1),\" (\",Draw!L14,\")\")))","v":""}," ",{"$f":"IF(Draw!M15=\"\", \"\", IF(Draw!M15=1, CONCATENATE(LEFT(Draw!J15,FIND(\" \",Draw!J15)+1),\" (\",Draw!L15,\")\"),CONCATENATE(LEFT(Draw!J16,FIND(\" \",Draw!J16)+1),\" (\",Draw!L16,\")\")))","v":""}]
[null,{"$f":"Setup!$B$7","v":"A-A C"},{"$f":"IF(Draw!M17=\"\", \"\", IF(Draw!M17=1, CONCATENATE(LEFT(Draw!J17,FIND(\" \",Draw!J17)+1),\" (\",Draw!L17,\")\"),CONCATENATE(LEFT(Draw!J18,FIND(\" \",Draw!J18)+1),\" (\",Draw!L18,\")\")))","v":""}," ",{"$f":"IF(Draw!M19=\"\", \"\", IF(Draw!M19=1, CONCATENATE(LEFT(Draw!J19,FIND(\" \",Draw!J19)+1),\" (\",Draw!L19,\")\"),CONCATENATE(LEFT(Draw!J20,FIND(\" \",Draw!J20)+1),\" (\",Draw!L20,\")\")))","v":""}]
[null,{"$f":"Setup!$B$7","v":"A-A C"},{"$f":"IF(Draw!M21=\"\", \"\", IF(Draw!M21=1, CONCATENATE(LEFT(Draw!J21,FIND(\" \",Draw!J21)+1),\" (\",Draw!L21,\")\"),CONCATENATE(LEFT(Draw!J22,FIND(\" \",Draw!J22)+1),\" (\",Draw!L22,\")\")))","v":""}," ",{"$f":"IF(Draw!M23=\"\", \"\", IF(Draw!M23=1, CONCATENATE(LEFT(Draw!J23,FIND(\" \",Draw!J23)+1),\" (\",Draw!L23,\")\"),CONCATENATE(LEFT(Draw!J24,FIND(\" \",Draw!J24)+1),\" (\",Draw!L24,\")\")))","v":""}]
["όχι πριν",{"$f":"Setup!$B$7","v":"A-A C"},{"$f":"IF(Draw!M25=\"\", \"\", IF(Draw!M25=1, CONCATENATE(LEFT(Draw!J25,FIND(\" \",Draw!J25)+1),\" (\",Draw!L25,\")\"),CONCATENATE(LEFT(Draw!J26,FIND(\" \",Draw!J26)+1),\" (\",Draw!L26,\")\")))","v":""}," ",{"$f":"IF(Draw!M27=\"\", \"\", IF(Draw!M27=1, CONCATENATE(LEFT(Draw!J27,FIND(\" \",Draw!J27)+1),\" (\",Draw!L27,\")\"),CONCATENATE(LEFT(Draw!J28,FIND(\" \",Draw!J28)+1),\" (\",Draw!L28,\")\")))","v":""}]
[null,{"$f":"Setup!$B$7","v":"A-A C"},{"$f":"IF(Draw!M29=\"\", \"\", IF(Draw!M29=1, CONCATENATE(LEFT(Draw!J29,FIND(\" \",Draw!J29)+1),\" (\",Draw!L29,\")\"),CONCATENATE(LEFT(Draw!J30,FIND(\" \",Draw!J30)+1),\" (\",Draw!L30,\")\")))","v":""}," ",{"$f":"IF(Draw!M31=\"\", \"\", IF(Draw!M31=1, CONCATENATE(LEFT(Draw!J31,FIND(\" \",Draw!J31)+1),\" (\",Draw!L31,\")\"),CONCATENATE(LEFT(Draw!J32,FIND(\" \",Draw!J32)+1),\" (\",Draw!L32,\")\")))","v":""}]
[null,{"$f":"Setup!$B$7","v":"A-A C"},{"$f":"IF(Draw!M33=\"\", \"\", IF(Draw!M33=1, CONCATENATE(LEFT(Draw!J33,FIND(\" \",Draw!J33)+1),\" (\",Draw!L33,\")\"),CONCATENATE(LEFT(Draw!J34,FIND(\" \",Draw!J34)+1),\" (\",Draw!L34,\")\")))","v":""}," ",{"$f":"IF(Draw!M35=\"\", \"\", IF(Draw!M35=1, CONCATENATE(LEFT(Draw!J35,FIND(\" \",Draw!J35)+1),\" (\",Draw!L35,\")\"),CONCATENATE(LEFT(Draw!J36,FIND(\" \",Draw!J36)+1),\" (\",Draw!L36,\")\")))","v":""}]
[" ",{"$f":"Setup!$B$7","v":"A-A C"},{"$f":"IF(Draw!M37=\"\", \"\", IF(Draw!M37=1, CONCATENATE(LEFT(Draw!J37,FIND(\" \",Draw!J37)+1),\" (\",Draw!L37,\")\"),CONCATENATE(LEFT(Draw!J38,FIND(\" \",Draw!J38)+1),\" (\",Draw!L38,\")\")))","v":""}," ",{"$f":"IF(Draw!M39=\"\", \"\", IF(Draw!M39=1, CONCATENATE(LEFT(Draw!J39,FIND(\" \",Draw!J39)+1),\" (\",Draw!L39,\")\"),CONCATENATE(LEFT(Draw!J40,FIND(\" \",Draw!J40)+1),\" (\",Draw!L40,\")\")))","v":""}]
[null,{"$f":"Setup!$B$7","v":"A-A C"},{"$f":"IF(Draw!M41=\"\", \"\", IF(Draw!M41=1, CONCATENATE(LEFT(Draw!J41,FIND(\" \",Draw!J41)+1),\" (\",Draw!L41,\")\"),CONCATENATE(LEFT(Draw!J42,FIND(\" \",Draw!J42)+1),\" (\",Draw!L42,\")\")))","v":""}," ",{"$f":"IF(Draw!M43=\"\", \"\", IF(Draw!M43=1, CONCATENATE(LEFT(Draw!J43,FIND(\" \",Draw!J43)+1),\" (\",Draw!L43,\")\"),CONCATENATE(LEFT(Draw!J44,FIND(\" \",Draw!J44)+1),\" (\",Draw!L44,\")\")))","v":""}]
[null,{"$f":"Setup!$B$7","v":"A-A C"},{"$f":"IF(Draw!M45=\"\", \"\", IF(Draw!M45=1, CONCATENATE(LEFT(Draw!J45,FIND(\" \",Draw!J45)+1),\" (\",Draw!L45,\")\"),CONCATENATE(LEFT(Draw!J46,FIND(\" \",Draw!J46)+1),\" (\",Draw!L46,\")\")))","v":""}," ",{"$f":"IF(Draw!M47=\"\", \"\", IF(Draw!M47=1, CONCATENATE(LEFT(Draw!J47,FIND(\" \",Draw!J47)+1),\" (\",Draw!L47,\")\"),CONCATENATE(LEFT(Draw!J48,FIND(\" \",Draw!J48)+1),\" (\",Draw!L48,\")\")))","v":""}]
[null,{"$f":"Setup!$B$7","v":"A-A C"},{"$f":"IF(Draw!M49=\"\", \"\", IF(Draw!M49=1, CONCATENATE(LEFT(Draw!J49,FIND(\" \",Draw!J49)+1),\" (\",Draw!L49,\")\"),CONCATENATE(LEFT(Draw!J50,FIND(\" \",Draw!J50)+1),\" (\",Draw!L50,\")\")))","v":""}," ",{"$f":"IF(Draw!M51=\"\", \"\", IF(Draw!M51=1, CONCATENATE(LEFT(Draw!J51,FIND(\" \",Draw!J51)+1),\" (\",Draw!L51,\")\"),CONCATENATE(LEFT(Draw!J52,FIND(\" \",Draw!J52)+1),\" (\",Draw!L52,\")\")))","v":""}]
[null,{"$f":"Setup!$B$7","v":"A-A C"},{"$f":"IF(Draw!M53=\"\", \"\", IF(Draw!M53=1, CONCATENATE(LEFT(Draw!J53,FIND(\" \",Draw!J53)+1),\" (\",Draw!L53,\")\"),CONCATENATE(LEFT(Draw!J54,FIND(\" \",Draw!J54)+1),\" (\",Draw!L54,\")\")))","v":""}," ",{"$f":"IF(Draw!M55=\"\", \"\", IF(Draw!M55=1, CONCATENATE(LEFT(Draw!J55,FIND(\" \",Draw!J55)+1),\" (\",Draw!L55,\")\"),CONCATENATE(LEFT(Draw!J56,FIND(\" \",Draw!J56)+1),\" (\",Draw!L56,\")\")))","v":""}]
[null,{"$f":"Setup!$B$7","v":"A-A C"},{"$f":"IF(Draw!M57=\"\", \"\", IF(Draw!M57=1, CONCATENATE(LEFT(Draw!J57,FIND(\" \",Draw!J57)+1),\" (\",Draw!L57,\")\"),CONCATENATE(LEFT(Draw!J58,FIND(\" \",Draw!J58)+1),\" (\",Draw!L58,\")\")))","v":""}," ",{"$f":"IF(Draw!M59=\"\", \"\", IF(Draw!M59=1, CONCATENATE(LEFT(Draw!J59,FIND(\" \",Draw!J59)+1),\" (\",Draw!L59,\")\"),CONCATENATE(LEFT(Draw!J60,FIND(\" \",Draw!J60)+1),\" (\",Draw!L60,\")\")))","v":""}]
[null,{"$f":"Setup!$B$7","v":"A-A C"},{"$f":"IF(Draw!M61=\"\", \"\", IF(Draw!M61=1, CONCATENATE(LEFT(Draw!J61,FIND(\" \",Draw!J61)+1),\" (\",Draw!L61,\")\"),CONCATENATE(LEFT(Draw!J62,FIND(\" \",Draw!J62)+1),\" (\",Draw!L62,\")\")))","v":""}," ",{"$f":"IF(Draw!M63=\"\", \"\", IF(Draw!M63=1, CONCATENATE(LEFT(Draw!J63,FIND(\" \",Draw!J63)+1),\" (\",Draw!L63,\")\"),CONCATENATE(LEFT(Draw!J64,FIND(\" \",Draw!J64)+1),\" (\",Draw!L64,\")\")))","v":""}]
[null,{"$f":"Setup!$B$7","v":"A-A C"},{"$f":"IF(Draw!M65=\"\", \"\", IF(Draw!M65=1, CONCATENATE(LEFT(Draw!J65,FIND(\" \",Draw!J65)+1),\" (\",Draw!L65,\")\"),CONCATENATE(LEFT(Draw!J66,FIND(\" \",Draw!J66)+1),\" (\",Draw!L66,\")\")))","v":""},{"$f":"IF(OR(C55=\"\",E55=\"\"),\" \",\"-\")","v":" "},{"$f":"IF(Draw!M67=\"\", \"\", IF(Draw!M67=1, CONCATENATE(LEFT(Draw!J67,FIND(\" \",Draw!J67)+1),\" (\",Draw!L67,\")\"),CONCATENATE(LEFT(Draw!J68,FIND(\" \",Draw!J68)+1),\" (\",Draw!L68,\")\")))","v":""}]
[]
["Πρόγραμμα αγώνων",null,null,null,"Round 3","i"," Don't change this Worksheet !"]
["ΩΡΑ","Κτγρ.","Αθλητής-Σύλλογος",null,"Αθλητής-Σύλλογος"]
[null,{"$f":"Setup!$B$7","v":"A-A C"},{"$f":"Draw!P6","v":""},{"$f":"IF(OR(C59=\"\",E59=\"\"),\" \",\"-\")","v":" "},{"$f":"Draw!P10","v":""}]
[null,{"$f":"Setup!$B$7","v":"A-A C"},{"$f":"Draw!P14","v":""}," ",{"$f":"Draw!P18","v":""}]
[null,{"$f":"Setup!$B$7","v":"A-A C"},{"$f":"Draw!P22","v":""}," ",{"$f":"Draw!P26","v":""}]
[null,{"$f":"Setup!$B$7","v":"A-A C"},{"$f":"Draw!P30","v":""}," ",{"$f":"Draw!P34","v":""}]
[null,{"$f":"Setup!$B$7","v":"A-A C"},{"$f":"Draw!P38","v":""}," ",{"$f":"Draw!P42","v":""}]
[null,{"$f":"Setup!$B$7","v":"A-A C"},{"$f":"Draw!P46","v":""}," ",{"$f":"Draw!P50","v":""}]
[null,{"$f":"Setup!$B$7","v":"A-A C"},{"$f":"Draw!P54","v":""}," ",{"$f":"Draw!P58","v":""}]
[null,{"$f":"Setup!$B$7","v":"A-A C"},{"$f":"Draw!P62","v":""}," ",{"$f":"Draw!P66","v":""}]
[]
["Πρόγραμμα αγώνων",null,null,null,"Round 4","i"," Don't change this Worksheet !"]
["ΩΡΑ","Κτγρ.","Αθλητής-Σύλλογος",null,"Αθλητής-Σύλλογος"]
[null,{"$f":"Setup!$B$7","v":"A-A C"},{"$f":"Draw!R8","v":""},{"$f":"IF(OR(C70=\"\",E70=\"\"),\" \",\"-\")","v":" "},{"$f":"Draw!R16","v":""}]
[null,{"$f":"Setup!$B$7","v":"A-A C"},{"$f":"Draw!R24","v":""},{"$f":"IF(OR(C71=\"\",E71=\"\"),\" \",\"-\")","v":" "},{"$f":"Draw!R32","v":""}]
[null,{"$f":"Setup!$B$7","v":"A-A C"},{"$f":"Draw!R40","v":""},{"$f":"IF(OR(C72=\"\",E72=\"\"),\" \",\"-\")","v":" "},{"$f":"Draw!R48","v":""}]
[null,{"$f":"Setup!$B$7","v":"A-A C"},{"$f":"Draw!R56","v":""},{"$f":"IF(OR(C73=\"\",E73=\"\"),\" \",\"-\")","v":" "},{"$f":"Draw!R64","v":""}]
[]
["Πρόγραμμα αγώνων",null,null,null,"Round 5","i"]
["ΩΡΑ","Κτγρ.","Αθλητής-Σύλλογος",null,"Αθλητής-Σύλλογος"]
[null,{"$f":"Setup!$B$7","v":"A-A C"},{"$f":"Draw!T12","v":""},{"$f":"IF(OR(C77=\"\",E77=\"\"),\" \",\"-\")","v":" "},{"$f":"Draw!T28","v":""}]
[null,{"$f":"Setup!$B$7","v":"A-A C"},{"$f":"Draw!T44","v":""},{"$f":"IF(OR(C78=\"\",E78=\"\"),\" \",\"-\")","v":" "},{"$f":"Draw!T60","v":""}]
[]
[]
[]
["Don't change this Worksheet !"]

{"sheet":"R1","index":4,"n_rows":33,"n_cols":6,"rows_kept":33,"cut":false,"hidden":false,"merged":[[0,0,0,5],[1,0,1,5],[2,5,3,5]]}
["Α' ΕΝΩΣΗ, 2ο Ε3,  (Α12)"]
[0]
["Πρόγραμμα αγώνων",null,null,null,"Round 1","i"]
["ΩΡΑ","Κτγρ.","Αθλητής-Σύλλογος",null,"Αθλητής-Σύλλογος"]
["Έναρξη"]
[]
[]
[]
["όχι πριν"]
[]
[]
[]
["όχι πριν"]
[]
[]
[]
["όχι πριν"]
[]
[]
[]
["όχι πριν"]
[]
[]
[]
["όχι πριν"]
[]
[]
[]
["όχι πριν"]
[]
[]
[]
["όχι πριν"]

{"sheet":"R2","index":5,"n_rows":20,"n_cols":6,"rows_kept":20,"cut":false,"hidden":false,"merged":[[0,0,0,5],[1,0,1,5],[2,5,3,5]]}
["Α' ΕΝΩΣΗ, 2ο Ε3,  (Α12)"]
[0]
["Πρόγραμμα αγώνων",null,null,null,"Round 1","i"]
["ΩΡΑ","Κτγρ.","Αθλητής-Σύλλογος",null,"Αθλητής-Σύλλογος"]
["Έναρξη",null,null," ",""]
[null,null,null," ",""]
[null,null,null," ",""]
[null,null,null," ",""]
["όχι πριν",null,null," ",""]
[null,null,null," ",""]
[null,null,null," ",""]
[null,null,null," ",""]
["όχι πριν",null,null," ",""]
[null,null,null," ",""]
[null,null,null," ",""]
[null,null,null," ",""]
["όχι πριν",null,null," ",""]
[null,null,null," ",""]
[null,null,null," ",""]
[null,null,null," ",""]

{"sheet":"R3, R4, R5","index":6,"n_rows":44,"n_cols":6,"rows_kept":44,"cut":false,"hidden":false,"merged":[[0,0,0,5],[1,0,1,5],[2,5,3,5],[19,5,20,5],[32,5,33,5]]}
["Α' ΕΝΩΣΗ, 2ο Ε3,  (Α12)"]
[0]
["Πρόγραμμα αγώνων",null,null,null,"Round 3","i"]
["ΩΡΑ","Κτγρ.","Αθλητής-Σύλλογος",null,"Αθλητής-Σύλλογος"]
["Έναρξη","Α12",""," ",""]
[null,"Α12",""," ",""]
[null,"Α12",""," ",""]
[null,"Α12",""," ",""]
["όχι πριν","Α12",""," ",""]
[null,"Α12",""," ",""]
[null,"Α12",""," ",""]
[null,"Α12",""," ",""]
[]
[]
[]
[]
[]
["Α' ΕΝΩΣΗ, 2ο Ε3,  (Α12)"]
[0]
["Πρόγραμμα αγώνων",null,null,null,"Round 4","i"]
["ΩΡΑ","Κτγρ.","Αθλητής-Σύλλογος",null,"Αθλητής-Σύλλογος"]
["Έναρξη","Α12",""," ",""]
[null,"Α12",""," ",""]
[null,"Α12",""," ",""]
[null,"Α12",""," ",""]
[]
[]
[]
[]
[]
["Α' ΕΝΩΣΗ, 2ο Ε3,  (Α12)"]
[0]
["Πρόγραμμα αγώνων",null,null,null,"Round 5","i"]
["ΩΡΑ","Κτγρ.","Αθλητής-Σύλλογος",null,"Αθλητής-Σύλλογος"]
["Έναρξη","Α12",""," ",""]
[null,"Α12",""," ",""]
[]
[]
[]
[]
[]
[]
[]
[" "]

{"sheet":"notes","index":7,"n_rows":2,"n_cols":1,"rows_kept":2,"cut":false,"hidden":false,"merged":[]}
["Α' ΕΝΩΣΗ, 2ο Ε3,  (Α12)"]
[0]

{"sheet":"tmp","index":8,"n_rows":65,"n_cols":24,"rows_kept":65,"cut":false,"hidden":false,"merged":[[31,9,33,9],[31,16,33,16],[20,8,22,8],[20,16,22,16],[25,9,25,22],[26,9,26,10],[26,16,26,17],[27,9,30,9],[27,16,30,16],[11,8,11,23],[12,16,12,17],[13,8,16,8],[13,16,16,16],[17,8,19,8],[17,16,19,16],[0,8,0,23],[1,16,1,17],[2,8,5,8],[2,16,5,16],[6,8,8,8],[6,16,8,16]]}
["RndIndx","random","FixRandom",null,"α/α","seed","bye",null,"ΠΡΟΚΡΙΜΑΤΙΚΑ E1, E2 (32 για 8)"]
[1,{"$f":"RAND()/222","v":1.2431115246962019E-3},5.2569749377454989E-4,null,1,1,null,null,null,null,"17-32","9-16","5-8","3-4","2ος","1ος",null,null,"17-32","9-16","5-8","3-4","2ος","1ος"]
[2,2.0504080265433878E-3,3.716204021374256E-3,null,2,null,1,null,"E1","E1-12",1,2,2,0,0,0,"E1","E1-12",1,1,0,0,0,0]
[3,1.0486332491904001E-3,7.4189261991627474E-4,null,3,null,null,null,null,"E1-14",3,4,4,0,0,0,null,"E1-14",3,1,0,0,0,0]
[4,1.1367215909047382E-3,3.1258977041393348E-3,null,4,null,29,null,null,"E1-16",6,8,8,0,0,0,null,"E1-16",6,2,0,0,0,0]
[5,{"$f":"RAND()/222","v":2.044971364682421E-3},3.5037585997559169E-3,null,5,null,null,null,null,"E1-18",7.5,10,10,null,null,null,null,"E1-18",7.5,2.5,0,0,0,0]
[6,{"$f":"RAND()/222","v":1.8367670505979182E-3},3.1462746246709652E-3,null,6,null,17,null,"E2","E2-12",0.3,0.5,0.5,0,0,0,"E2","E2-12",0.3,0.2,0,0,0,0]
[7,{"$f":"RAND()/222","v":3.6202967091819851E-3},3.6807878020697861E-3,null,7,null,13,null,null,"E2-14",1,2,2,0,0,0,null,"E2-14",1,1,0,0,0,0]
[8,3.1416679116334275E-3,2.2311311084535052E-3,null,8,13,null,null,null,"E2-16",2,4,4,0,0,0,null,"E2-16",2,2,0,0,0,0]
[9,1.3255126272550858E-3,1.0242326640316163E-3,null,9,11]
[10,9.7595238876103355E-4,4.3885891256489912E-3,null,10,null,9]
[11,3.9896570144729035E-3,3.4037156641968259E-3,null,11,null,null,null,"ΚΥΡΙΩΣ ΤΑΜΠΛΟ E1, E2 & E3"]
[12,1.76549859223111E-3,3.9029554214002051E-4,null,12,null,25,null,null,null,"17-32","9-16","5-8","3-4","2ος","1ος",null,null,"17-32","9-16","5-8","3-4","2ος","1ος"]
[13,3.9308731420871316E-3,3.8677240688477161E-3,null,13,null,null,null,"E1","E1-12",7,10,14,21,35,42,"E1","E1-12",7,3,4,7,14,7]
[14,2.9668281944028327E-3,2.235346199736784E-3,null,14,null,21,null,null,"E1-14",10,15,20,30,50,60,null,"E1-14",10,5,5,10,20,10]
[15,1.8500327798126554E-3,4.3908889756680454E-3,null,15,null,5,null,null,"E1-16",20,30,40,60,100,120,null,"E1-16",20,10,10,20,40,20]
[16,1.8592590369055342E-3,2.5694039943728155E-3,null,16,8,null,null,null,"E1-18",25,37,50,75,125,150,null,"E1-18",25,12,13,25,50,25]
[17,1.7728471171403622E-3,1.1458248008327835E-3,null,17,3,null,null,"E2","E2-12",4,5,7,10,15,18,"E2","E2-12",4,1,2,3,5,3]
[18,2.9296104973288418E-3,1.1876593002907952E-3,null,18,null,3,null,null,"E2-14",5,8,10,15,25,30,null,"E2-14",5,3,2,5,10,5]
[19,1.9464908820701046E-4,2.0694973391932421E-3,null,19,null,null,null,null,"E2-16",10,15,20,30,50,60,null,"E2-16",10,5,5,10,20,10]
[20,3.1422804600610431E-4,1.301747214556438E-3,null,20,null,31,null,"E3","E3-12",0.5,2,3,4,7,8,"E3","E3-12",0.5,1.5,1,1,3,1]
[21,1.5762686890477536E-3,4.3967786258064532E-3,null,21,null,null,null,null,"E3-14",2,3,4,6,10,12,null,"E3-14",2,1,1,2,4,2]
[22,2.9762139129041764E-3,1.2614256019235443E-3,null,22,null,19,null,null,"E3-16",4,6,8,12,20,24,null,"E3-16",4,2,2,4,8,4]
[23,1.0791552413510316E-5,1.5896587235462789E-4,null,23,null,15]
[24,3.7358776515245425E-3,2.4764714784467805E-3,null,24,15]
[25,7.5969749592528742E-4,2.2656564701454005E-3,null,25,12,null,null,null,"ΔΙΠΛΑ E1, E2"]
[26,1.8786257361460307E-3,2.6877726409101662E-4,null,26,null,11,null,null,null,null,"9-16","5-8","3-4","2ος","1ος",null,null,"9-16","5-8","3-4","2ος","1ος"]
[27,2.715394605124381E-3,1.5978127716171258E-3,null,27,null,null,null,null,"E1","E1-12",3,4,5,9,11,"E1","E1-12",3,1,1,4,2]
[28,2.1814984176071208E-3,1.7633291024635744E-3,null,28,null,27,null,null,null,"E1-14",4,5,8,13,15,null,"E1-14",4,1,3,5,2]
[29,1.4253378081450238E-3,8.4006340154300951E-4,null,29,null,null,null,null,null,"E1-16",8,10,15,25,30,null,"E1-16",8,2,5,10,5]
[30,3.919494708071721E-3,2.2793293203560599E-3,null,30,null,23,null,null,null,"E1-18",9,12,19,31,37,null,"E1-18",9,3,7,12,6]
[31,2.5777154371453858E-3,6.5184873855006085E-4,null,31,null,7,null,null,"E2","E2-12",1,2,3,4,8,"E2","E2-12",1,1,1,1,4]
[32,2.7157686223120174E-3,3.6379018099392361E-3,null,32,6,null,null,null,null,"E2-14",2,3,4,6,8,null,"E2-14",2,1,1,2,2]
[33,1.0882892426747162E-4,2.9164787430153295E-3,null,33,5,null,null,null,null,"E2-16",4,6,8,12,16,null,"E2-16",4,2,2,4,4]
[34,3.1478937933398063E-3,4.4712770907442342E-3,null,34,null,8]
[35,2.3496309575942085E-4,4.1396393306734752E-3,null,35]
[36,3.4628211979768645E-3,2.7226483850307424E-3,null,36,null,28]
[37,2.949571138943959E-3,2.5761573680904283E-3,null,37]
[38,3.3688231621593063E-3,3.6493517349492199E-3,null,38,null,20]
[39,3.502247458144583E-3,4.0317126552084949E-3,null,39,null,12]
[40,9.9686005787219881E-4,6.5477300338301044E-4,null,40,10]
[41,3.2074570721815315E-3,7.9328437902715418E-4,null,41,14]
[42,3.759838776032462E-3,4.4434413951728157E-3,null,42,null,16]
[43,6.9894355469095771E-4,4.4088890798114561E-3,null,43]
[44,1.4731774700455138E-3,3.949713174562517E-4,null,44,null,24]
[45,3.571513319893208E-3,1.6457757571571672E-3,null,45]
[46,4.3670894557348511E-3,4.3893548001563724E-3,null,46,null,32]
[47,2.3886447816833245E-3,3.6021504289067397E-3,null,47,null,4]
[48,7.8745255768738901E-4,2.8216094496348429E-3,null,48,4]
[49,1.0972120386046641E-3,9.9201923332780311E-5,null,49,7]
[50,3.5886966640698466E-3,5.8811341850842488E-4,null,50,null,6]
[51,2.3464802436940387E-3,2.9966215482674116E-3,null,51]
[52,1.4357546532493333E-3,2.9058220702485142E-4,null,52,null,22]
[53,1.3766523792071278E-3,2.0615806761918316E-3,null,53]
[54,1.85417042200056E-3,9.1664440631633091E-5,null,54,null,26]
[55,7.549817262317728E-4,4.4354318993836319E-3,null,55,null,10]
[56,7.8334730697770985E-4,3.7189689512944575E-4,null,56,9]
[57,3.350603085380586E-3,2.0498483417336747E-3,null,57,16]
[58,1.9464508539573653E-3,3.1428197043800905E-3,null,58,null,14]
[59,3.9389912924081578E-3,2.4344333702733009E-3,null,59]
[60,3.5432626113280656E-3,2.1222357728358757E-3,null,60,null,18]
[61,1.5298802719515569E-3,2.6071459720036238E-3,null,61]
[62,2.3407014849609145E-3,2.5020093650881545E-3,null,62,null,30]
[63,9.2480214133298065E-4,2.1322137455800382E-3,null,63,null,2]
[64,4.4019681757043122E-3,4.319046889309377E-3,null,64,2]

{"sheet":"tmpRankings","index":9,"n_rows":2,"n_cols":7,"rows_kept":2,"cut":false,"hidden":false,"merged":[]}
["ΑΜ","Ονοματεπώνυμο","Γεν.","Σύλλογος","Βαθμ"]
[null,null,null,null,null,null,"=VLOOKUP(c3;tmpRankings!$A$2:$E$251;5;FALSE)"]