{"text_format":"1","workbook":"xlsx","n_sheets":10,"sheets":["Setup","DrawPrep","Draw","PrgPrep","R1","R2","R3, R4, R5","notes","tmp","tmpRankings"],"not_rendered":{"charts":0,"images":0,"macros":1,"external_links":0,"defined_names":6,"comments":0,"pivot_tables":0},"unopened":[],"bounds":{"document_bytes":16777216,"sheet_cells":100000,"rows_first":2000,"rows_last":500,"rows_between":2000,"halvings":0,"cell_chars":16384,"cell_head_chars":4096},"cells_cut":0,"cells_raw":0,"read":"whole","date_system":"1900"}

{"sheet":"Setup","index":0,"n_rows":65,"n_cols":14,"rows_kept":65,"cut":false,"hidden":false,"merged":[[1,3,2,3],[4,3,7,3],[9,3,12,3],[14,3,17,3],[0,0,0,1]]}
["64άρι ταμπλό",null,null,"Θέσεις","seed",null,null,0,"seed","space pos","Index","Value",null,"0 0 0 0 0 0 0 0 0 0 0 0 0 0 0 0 0 0 0 0 0 0 0 0 0 0 0 0 0 0 0 0 0 0 0 0 0 0 0 0 0 0 1 2 3 4 5 6 7 8 9 10 11 12 13 14 15 16 19 20 21 18 22 17 "]
[null,null,null,"3-4",{"$f":"VALUE(LEFT(F2,1))","v":3},"3 4",null,{"$f":"IF(I2=\"-\",\"-\",IF(I2>0,H1+1,0))","v":0},{"$f":"IF(J2>0,VALUE(MID($N$1,1,J2-1)),\"-\")","v":0},{"$f":"IF(LEN($N$1)>1,FIND(\" \",$N$1,1),0)","v":2},0,0,null,"1 2 3 4 5 6 7 8 9 10 11 12 13 14 15 16 "]
["Διοργανωτής: ","ΕΦΟΑ",null,null,{"$f":"VALUE(RIGHT(F2,1))","v":4},null,null,{"$f":"IF(I3=\"-\",\"-\",IF(I3>0,H2+1,0))","v":0},{"$f":"IF(J3>0,VALUE(MID($N$1,J2+1,J3-J2-1)),\"-\")","v":0},{"$f":"IF(AND(J2>0,LEN($N$1)>J2+1),FIND(\" \",$N$1,J2+1),0)","v":4},0,0,null,"0 0 0 0 0 0 0 0 0 0 0 0 0 0 0 0 0 0 0 0 0 0 0 0 0 0 0 0 0 0 0 0 0 0 0 0 0 0 0 0 0 0 0 0 0 0 0 0 0 0 0 0 0 0 0 0 0 0 0 0 0 0 0 0  "]
["Τίτλος Τουρνουά: ","ΠΑΝΕΛΛΑΔΙΚΟ U10",null,"Θέσεις","seed",null,null,{"$f":"IF(I4>0,H3+1,0)","v":0},0,6,0,0]
["type: ","u10",null,"5-8",{"$f":"TRIM(LEFT(F5,(FIND(\" \",F5,1)-1)))","v":"7"},"7 5 8 6",null,0,0,8,0,0]
["Έδρα αγώνων: ","ΑΕΤ ΝΙΚΗ ΠΑΤΡΩΝ",null,null,{"$f":"TRIM(MID(F5,(FIND(\" \",F5,1)),FIND(\" \",F5,(FIND(\" \",F5,1)+1))-(FIND(\" \",F5,1))))","v":"5"},null,null,0,0,10,0,0]
["Κατηγορία: ","A-A C",null,null,{"$f":"TRIM(MID(F5, (FIND(\" \",F5,(FIND(\" \",F5,1)+1))+1), (FIND(\" \",F5,(FIND(\" \",F5,(FIND(\" \",F5,1)+1))+1)))-(FIND(\" \",F5,(FIND(\" \",F5,1)+1))+1)))","v":"8"},null,null,0,0,12,0,0]
["Έναρξη: ","24",null,null,{"$f":"TRIM(RIGHT(F5,LEN(F5)-(FIND(\" \",F5,(FIND(\" \",F5,(FIND(\" \",F5,1)+1))+1)))))","v":"6"},null,null,0,0,14,0,0]
["Λήξη: ","25 OKT 2015",null,"Θέσεις","seed",null,null,0,{"$f":"IF(J9>0,VALUE(MID($N$1,J8+1,J9-J8-1)),\"-\")","v":0},16,0,0]
["Επιδιατητής: ","Στέφος Αλέξης",null,"9-12",{"$f":"TRIM(LEFT(F10,(FIND(\" \",F10,1)-1)))","v":"12"},"12 11 10 9",null,0,0,18,0,0]
["Τηλέφωνο επιδ: ",2610642100,null,null,{"$f":"TRIM(MID(F10,(FIND(\" \",F10,1)),FIND(\" \",F10,(FIND(\" \",F10,1)+1))-(FIND(\" \",F10,1))))","v":"11"},null,null,0,0,20,0,0]
[null,null,null,null,{"$f":"TRIM(MID(F10, (FIND(\" \",F10,(FIND(\" \",F10,1)+1))+1), (FIND(\" \",F10,(FIND(\" \",F10,(FIND(\" \",F10,1)+1))+1)))-(FIND(\" \",F10,(FIND(\" \",F10,1)+1))+1)))","v":"10"},null,null,0,0,22,0,0]
[null,null,null,null,{"$f":"TRIM(RIGHT(F10,LEN(F10)-(FIND(\" \",F10,(FIND(\" \",F10,(FIND(\" \",F10,1)+1))+1)))))","v":"9"},null,null,0,0,24,0,0]
[null,null,null,"Θέσεις","seed",null,null,0,0,26,0,0]
[null,null,null,"13-16",{"$f":"TRIM(LEFT(F15,(FIND(\" \",F15,1)-1)))","v":"13"},"13 15 16 14",null,0,0,28,0,0]
{"$rows_left_out":51}
{"sheet":"DrawPrep","index":1,"n_rows":80,"n_cols":11,"rows_kept":80,"cut":false,"hidden":false,"merged":[[68,1,68,3]]}
[{"$f":"Setup!B3&\", \"&Setup!B4&\", \"&Setup!B6&\", \"&Setup!B8&\"-\"&Setup!B9","v":"ΕΦΟΑ, ΠΑΝΕΛΛΑΔΙΚΟ U10, ΑΕΤ ΝΙΚΗ ΠΑΤΡΩΝ, 24-25 OKT 2015"},null,null,null,null,null,null,{"$f":"Setup!B7","v":"A-A C"}]
["α/α","από","Α.Μ.","Ονοματεπώνυμο","Σύλλογος","βαθμοί","Τηλέφωνο","Υπογραφή","SortPts","Rnd","trim"]
[1,null,36587,"ΙΑΚΩΒΑΚΗΣ ΕΛΕΥΘΕΡΙΟΣ","Ο.Α. ΦΟΙΒΟΣ ΛΑΡΙΣΑΣ",23,null,null,{"$f":"IF(D3>\" \",IF(F3>=0,F3+tmp!C53,tmp!C53),0)","v":23.000290582207025},4.3967786258064532E-3,{"$f":"TRIM(D3)","v":"ΙΑΚΩΒΑΚΗΣ ΕΛΕΥΘΕΡΙΟΣ"}]
[2,null,36852,"ΤΖΩΡΤΖΑΤΟΣ ΚΩΝΣΤΑΝΤΙΝΟΣ","ΑΟΑ ΠΑΤΡΩΝ",22,null,null,{"$f":"IF(D4>\" \",IF(F4>=0,F4+tmp!C49,tmp!C49),0)","v":22.002821609449636},2.5694039943728155E-3,{"$f":"TRIM(D4)","v":"ΤΖΩΡΤΖΑΤΟΣ ΚΩΝΣΤΑΝΤΙΝΟΣ"}]
[3,null,33991,"ΛΑΜΠΡΟΠΟΥΛΟΣ ΜΙΧΑΛΗΣ","ΑΕΚ ΤΡΙΠΟΛΗΣ",21,null,null,{"$f":"IF(D5>\" \",IF(F5>=0,F5+tmp!C8,tmp!C8),0)","v":21.003680787802068},3.9029554214002051E-4,{"$f":"TRIM(D5)","v":"ΛΑΜΠΡΟΠΟΥΛΟΣ ΜΙΧΑΛΗΣ"}]
[4,null,40000,"ΓΟΥΔΕΛΗΣ ΔΗΜΗΤΡΗΣ","Α.Σ. ΑΣΤΕΡΑΣ ΠΕΝΤΕΛΙΚΟΥ",20,null,null,{"$f":"IF(D6>\" \",IF(F6>=0,F6+tmp!C34,tmp!C34),0)","v":20.002916478743014},4.3885891256489912E-3,{"$f":"TRIM(D6)","v":"ΓΟΥΔΕΛΗΣ ΔΗΜΗΤΡΗΣ"}]
[5,null,32434,"ΡΟΖΗΣ ΔΗΜΗΤΡΗΣ","Α.Ε.Τ. ΝΙΚΗ ΠΑΤΡΩΝ",19,null,null,{"$f":"IF(D7>\" \",IF(F7>=0,F7+tmp!C43,tmp!C43),0)","v":19.004443441395171},3.6807878020697861E-3,{"$f":"TRIM(D7)","v":"ΡΟΖΗΣ ΔΗΜΗΤΡΗΣ"}]
[6,null,37981,"ΓΙΑΝΝΟΣ ΗΛΙΑΣ","Α.Γ.Ο. ΦΙΛΙΠΠΙΑΔΑΣ",18,null,null,{"$f":"IF(D8>\" \",IF(F8>=0,F8+tmp!C37,tmp!C37),0)","v":18.002722648385031},7.4189261991627474E-4,{"$f":"TRIM(D8)","v":"ΓΙΑΝΝΟΣ ΗΛΙΑΣ"}]
[7,null,37444,"ΝΙΚΟΛΑΟΥ ΑΓΓΕΛΟΣ","Α.Ε.Τ. ΝΙΚΗ ΠΑΤΡΩΝ",17,null,null,{"$f":"IF(D9>\" \",IF(F9>=0,F9+tmp!C33,tmp!C33),0)","v":17.003637901809938},3.1462746246709652E-3,{"$f":"TRIM(D9)","v":"ΝΙΚΟΛΑΟΥ ΑΓΓΕΛΟΣ"}]
[8,null,37478,"ΚΑΡΑΟΥΛΑΝΗΣ ΒΑΣΙΛΕΙΟΣ","Ο.Α. ΦΟΙΒΟΣ ΛΑΡΙΣΑΣ",16,null,null,{"$f":"IF(D10>\" \",IF(F10>=0,F10+tmp!C28,tmp!C28),0)","v":16.001597812771617},1.301747214556438E-3,{"$f":"TRIM(D10)","v":"ΚΑΡΑΟΥΛΑΝΗΣ ΒΑΣΙΛΕΙΟΣ"}]
[9,null,37979,"ΧΑΤΖΟΠΟΥΛΟΣ ΒΑΣΙΛΕΙΟΣ","Α.Γ.Ο. ΦΙΛΙΠΠΙΑΔΑΣ",15,null,null,{"$f":"IF(D11>\" \",IF(F11>=0,F11+tmp!C22,tmp!C22),0)","v":15.004396778625807},3.716204021374256E-3,{"$f":"TRIM(D11)","v":"ΧΑΤΖΟΠΟΥΛΟΣ ΒΑΣΙΛΕΙΟΣ"}]
[10,null,33122,"ΑΦΑΛΩΝΙΑΤΗΣ ΘΑΝΟΣ","Α.Ε.Τ. ΝΙΚΗ ΠΑΤΡΩΝ",14,null,null,{"$f":"IF(D12>\" \",IF(F12>=0,F12+tmp!C51,tmp!C51),0)","v":14.000588113418509},3.5037585997559169E-3,{"$f":"TRIM(D12)","v":"ΑΦΑΛΩΝΙΑΤΗΣ ΘΑΝΟΣ"}]
[11,null,37434,"ΚΑΤΑΠΟΔΗΣ ΓΙΩΡΓΟΣ","ΑΟΑ ΠΑΤΡΩΝ",13,null,null,{"$f":"IF(D13>\" \",IF(F13>=0,F13+tmp!C27,tmp!C27),0)","v":13.000268777264091},4.3908889756680454E-3,{"$f":"TRIM(D13)","v":"ΚΑΤΑΠΟΔΗΣ ΓΙΩΡΓΟΣ"}]
[12,null,60000,"ΜΟΣΧΟΒΙΝΟΣ ΑΛΕΞΙΟΣ","Α.Σ. ΑΣΤΕΡΑΣ ΠΕΝΤΕΛΙΚΟΥ",12,null,null,{"$f":"IF(D14>\" \",IF(F14>=0,F14+tmp!C24,tmp!C24),0)","v":12.000158965872355},1.0242326640316163E-3,{"$f":"TRIM(D14)","v":"ΜΟΣΧΟΒΙΝΟΣ ΑΛΕΞΙΟΣ"}]
[13,null,33992,"ΛΑΜΠΡΟΠΟΥΛΟΣ ΑΓΓΕΛΟΣ","ΑΕΚ ΤΡΙΠΟΛΗΣ",11,null,null,{"$f":"IF(D15>\" \",IF(F15>=0,F15+tmp!C40,tmp!C40),0)","v":11.004031712655209},3.4037156641968259E-3,{"$f":"TRIM(D15)","v":"ΛΑΜΠΡΟΠΟΥΛΟΣ ΑΓΓΕΛΟΣ"}]
{"$rows_left_out":66}
{"sheet":"Draw","index":2,"n_rows":106,"n_cols":21,"rows_kept":106,"cut":false,"hidden":false,"merged":[[69,15,69,16],[2,9,2,11],[0,0,0,17]]}
[{"$f":"Setup!B3&\", \"&Setup!B4&\", \"&Setup!B6&\", \"&Setup!B8&\"-\"&Setup!B9","v":"ΕΦΟΑ, ΠΑΝΕΛΛΑΔΙΚΟ U10, ΑΕΤ ΝΙΚΗ ΠΑΤΡΩΝ, 24-25 OKT 2015"},null,null,null,null,null,null,null,null,null,null,null,null,null,null,null,null,null,null,{"$f":"Setup!B7","v":"A-A C"}]
[null,{"$f":"Setup!B18","v":42},null,null,null,null,null,null,"p1",null,null,null,null,"p2",null,"p3",null,"p4",null,"p5-6"]
[null,null,null,null,null,null,null,null,null,64,null,null,null,32,null,16,null,8,null,"4 & 2"]
["α/α",null,"ByeOrder","ByeSum","ByeCnt","από","seed","Pts","Α.Μ.","Ονοματεπώνυμο","επώνυμο","Σύλλογος"]
[1,1,null,null,0,{"$f":"IF(NOT($G5=\"-\"),VLOOKUP($G5,DrawPrep!$A$3:$F$66,2,FALSE),\"\")","v":0},{"$f":"VLOOKUP($B5,Setup!$K$2:$L$65,2,FALSE)","v":1},{"$f":"IF($G5>0,VLOOKUP($G5,DrawPrep!$A$3:$F$66,6,FALSE),0)","v":23},{"$f":"IF(Setup!$B$24=\"#\",0,IF($G5>0,VLOOKUP($G5,DrawPrep!$A$3:$F$66,3,FALSE),0))","v":36587},{"$f":"IF($I5>0,VLOOKUP($I5,DrawPrep!$C$3:$F$66,2,FALSE),\"bye\")","v":"ΙΑΚΩΒΑΚΗΣ ΕΛΕΥΘΕΡΙΟΣ"},{"$f":"IF(NOT(I5>0),\"\", IF(ISERROR(FIND(\"-\",J5)), LEFT(J5,FIND(\" \",J5)-1), IF(FIND(\"-\",J5)>FIND(\" \",J5),LEFT(J5,FIND(\" \",J5)-1), LEFT(J5,FIND(\"-\",J5)-1) )))","v":"ΙΑΚΩΒΑΚΗΣ"},{"$f":"IF($I5>0,VLOOKUP($I5,DrawPrep!$C$3:$F$66,3,FALSE),\"\")","v":"Ο.Α. ΦΟΙΒΟΣ ΛΑΡΙΣΑΣ"},null,{"$f":"UPPER(IF($A$2=\"R\",IF(OR(M5=1,M5=\"a\"),I5,IF(OR(M5=2,M5=\"b\"),I6,\"\")),IF(OR(M5=1,M5=\"1\"),K5,IF(OR(M5=2,M5=\"b\"),K6,\"\"))))","v":""}]
[2,{"$f":"1-D6+16","v":16},{"$f":"B5","v":1},{"$f":"E6","v":1},{"$f":"IF($B$2>=C6,1,0)","v":1},{"$f":"IF(NOT($G6=\"-\"),VLOOKUP($G6,DrawPrep!$A$3:$F$66,2,FALSE),\"\")","v":""},{"$f":"IF($B$2>=C6,\"-\",VLOOKUP($B6,Setup!$K$2:$L$65,2,FALSE))","v":"-"},{"$f":"IF(NOT($G6=\"-\"),VLOOKUP($G6,DrawPrep!$A$3:$F$66,6,FALSE),0)","v":0},{"$f":"IF(Setup!$B$24=\"#\",0,IF(NOT($G6=\"-\"),VLOOKUP($G6,DrawPrep!$A$3:$F$66,3,FALSE),0))","v":0},{"$f":"IF($I6>0,VLOOKUP($I6,DrawPrep!$C$3:$F$66,2,FALSE),\"bye\")","v":"bye"},{"$f":"IF(NOT(I6>0),\"\", IF(ISERROR(FIND(\"-\",J6)), LEFT(J6,FIND(\" \",J6)-1), IF(FIND(\"-\",J6)>FIND(\" \",J6),LEFT(J6,FIND(\" \",J6)-1), LEFT(J6,FIND(\"-\",J6)-1) )))","v":""},{"$f":"IF($I6>0,VLOOKUP($I6,DrawPrep!$C$3:$F$66,3,FALSE),\"\")","v":""},null,null,null,{"$f":"UPPER(IF($A$2=\"R\",IF(OR(O6=1,O6=\"a\"),N5,IF(OR(O6=2,O6=\"b\"),N7,\"\")),IF(OR(O6=1,O6=\"a\"),N5,IF(OR(O6=2,O6=\"b\"),N7,\"\"))))","v":""}]
[3,{"$f":"2-D7+16","v":17},null,{"$f":"D6+E7","v":1},0,{"$f":"IF(NOT($G7=\"-\"),VLOOKUP($G7,DrawPrep!$A$3:$F$66,2,FALSE),\"\")","v":0},{"$f":"VLOOKUP($B7,Setup!$K$2:$L$65,2,FALSE)","v":19},{"$f":"IF($G7>0,VLOOKUP($G7,DrawPrep!$A$3:$F$66,6,FALSE),0)","v":0},{"$f":"IF(Setup!$B$24=\"#\",0,IF($G7>0,VLOOKUP($G7,DrawPrep!$A$3:$F$66,3,FALSE),0))","v":37254},{"$f":"IF($I7>0,VLOOKUP($I7,DrawPrep!$C$3:$F$66,2,FALSE),\"bye\")","v":"ΤΖΙΤΖΙΜΙΚΑΣ ΓΕΩΡΓΙΟΣ"},"ΤΖΙΤΖΙΜΙΚΑΣ",{"$f":"IF($I7>0,VLOOKUP($I7,DrawPrep!$C$3:$F$66,3,FALSE),\"\")","v":"Α.Ο. ΚΟΛΕΓΙΟΥ ΝΤΕΡΗ"},null,{"$f":"UPPER(IF($A$2=\"R\",IF(OR(M7=1,M7=\"a\"),I7,IF(OR(M7=2,M7=\"b\"),I8,\"\")),IF(OR(M7=1,M7=\"a\"),K7,IF(OR(M7=2,M7=\"b\"),K8,\"\"))))","v":""}]
[4,{"$f":"3-D8+16","v":17},29,{"$f":"D7+E8","v":2},{"$f":"IF($B$2>=C8,1,0)","v":1},{"$f":"IF(NOT($G8=\"-\"),VLOOKUP($G8,DrawPrep!$A$3:$F$66,2,FALSE),\"\")","v":""},{"$f":"IF($B$2>=C8,\"-\",VLOOKUP($B8,Setup!$K$2:$L$65,2,FALSE))","v":"-"},{"$f":"IF(NOT($G8=\"-\"),VLOOKUP($G8,DrawPrep!$A$3:$F$66,6,FALSE),0)","v":0},{"$f":"IF(Setup!$B$24=\"#\",0,IF(NOT($G8=\"-\"),VLOOKUP($G8,DrawPrep!$A$3:$F$66,3,FALSE),0))","v":0},{"$f":"IF($I8>0,VLOOKUP($I8,DrawPrep!$C$3:$F$66,2,FALSE),\"bye\")","v":"bye"},"",{"$f":"IF($I8>0,VLOOKUP($I8,DrawPrep!$C$3:$F$66,3,FALSE),\"\")","v":""},null,null,null,null,null,{"$f":"UPPER(IF($A$2=\"R\",IF(OR(Q8=1,Q8=\"a\"),P6,IF(OR(Q8=2,Q8=\"b\"),P10,\"\")),IF(OR(Q8=1,Q8=\"a\"),P6,IF(OR(Q8=2,Q8=\"b\"),P10,\"\"))))","v":""}]
[5,{"$f":"4-D9+16","v":18},null,2,0,{"$f":"IF(NOT($G9=\"-\"),VLOOKUP($G9,DrawPrep!$A$3:$F$66,2,FALSE),\"\")","v":0},{"$f":"VLOOKUP($B9,Setup!$K$2:$L$65,2,FALSE)","v":20},{"$f":"IF($G9>0,VLOOKUP($G9,DrawPrep!$A$3:$F$66,6,FALSE),0)","v":0},{"$f":"IF(Setup!$B$24=\"#\",0,IF($G9>0,VLOOKUP($G9,DrawPrep!$A$3:$F$66,3,FALSE),0))","v":31968},{"$f":"IF($I9>0,VLOOKUP($I9,DrawPrep!$C$3:$F$66,2,FALSE),\"bye\")","v":"ΨΑΡΑΚΗΣ ΓΙΑΝΝΗΣ"},"ΨΑΡΑΚΗΣ",{"$f":"IF($I9>0,VLOOKUP($I9,DrawPrep!$C$3:$F$66,3,FALSE),\"\")","v":"ΚΙΑΤΟ"},null,{"$f":"UPPER(IF($A$2=\"R\",IF(OR(M9=1,M9=\"a\"),I9,IF(OR(M9=2,M9=\"b\"),I10,\"\")),IF(OR(M9=1,M9=\"a\"),K9,IF(OR(M9=2,M9=\"b\"),K10,\"\"))))","v":""}]
[6,{"$f":"5-D10+16","v":18},17,3,{"$f":"IF($B$2>=C10,1,0)","v":1},{"$f":"IF(NOT($G10=\"-\"),VLOOKUP($G10,DrawPrep!$A$3:$F$66,2,FALSE),\"\")","v":""},{"$f":"IF($B$2>=C10,\"-\",VLOOKUP($B10,Setup!$K$2:$L$65,2,FALSE))","v":"-"},{"$f":"IF(NOT($G10=\"-\"),VLOOKUP($G10,DrawPrep!$A$3:$F$66,6,FALSE),0)","v":0},{"$f":"IF(Setup!$B$24=\"#\",0,IF(NOT($G10=\"-\"),VLOOKUP($G10,DrawPrep!$A$3:$F$66,3,FALSE),0))","v":0},{"$f":"IF($I10>0,VLOOKUP($I10,DrawPrep!$C$3:$F$66,2,FALSE),\"bye\")","v":"bye"},"",{"$f":"IF($I10>0,VLOOKUP($I10,DrawPrep!$C$3:$F$66,3,FALSE),\"\")","v":""},null,null,null,{"$f":"UPPER(IF($A$2=\"R\",IF(OR(O10=1,O10=\"a\"),N9,IF(OR(O10=2,O10=\"b\"),N11,\"\")),IF(OR(O10=1,O10=\"a\"),N9,IF(OR(O10=2,O10=\"b\"),N11,\"\"))))","v":""}]
[7,{"$f":"6-D11+16","v":18},{"$f":"B12","v":13},4,{"$f":"IF($B$2>=C11,1,0)","v":1},{"$f":"IF(NOT($G11=\"-\"),VLOOKUP($G11,DrawPrep!$A$3:$F$66,2,FALSE),\"\")","v":""},{"$f":"IF($B$2>=C11,\"-\",VLOOKUP($B11,Setup!$K$2:$L$65,2,FALSE))","v":"-"},{"$f":"IF(NOT($G11=\"-\"),VLOOKUP($G11,DrawPrep!$A$3:$F$66,6,FALSE),0)","v":0},{"$f":"IF(Setup!$B$24=\"#\",0,IF(NOT($G11=\"-\"),VLOOKUP($G11,DrawPrep!$A$3:$F$66,3,FALSE),0))","v":0},{"$f":"IF($I11>0,VLOOKUP($I11,DrawPrep!$C$3:$F$66,2,FALSE),\"bye\")","v":"bye"},"",{"$f":"IF($I11>0,VLOOKUP($I11,DrawPrep!$C$3:$F$66,3,FALSE),\"\")","v":""},null,{"$f":"UPPER(IF($A$2=\"R\",IF(OR(M11=1,M11=\"a\"),I11,IF(OR(M11=2,M11=\"b\"),I12,\"\")),IF(OR(M11=1,M11=\"a\"),K11,IF(OR(M11=2,M11=\"b\"),K12,\"\"))))","v":""}]
[8,{"$f":"VALUE(Setup!E15)","v":13},null,4,0,{"$f":"IF(NOT($G12=\"-\"),VLOOKUP($G12,DrawPrep!$A$3:$F$66,2,FALSE),\"\")","v":0},{"$f":"VLOOKUP($B12,Setup!$K$2:$L$65,2,FALSE)","v":13},{"$f":"IF($G12>0,VLOOKUP($G12,DrawPrep!$A$3:$F$66,6,FALSE),0)","v":11},{"$f":"IF(Setup!$B$24=\"#\",0,IF($G12>0,VLOOKUP($G12,DrawPrep!$A$3:$F$66,3,FALSE),0))","v":33992},{"$f":"IF($I12>0,VLOOKUP($I12,DrawPrep!$C$3:$F$66,2,FALSE),\"bye\")","v":"ΛΑΜΠΡΟΠΟΥΛΟΣ ΑΓΓΕΛΟΣ"},"ΛΑΜΠΡΟΠΟΥΛΟΣ",{"$f":"IF($I12>0,VLOOKUP($I12,DrawPrep!$C$3:$F$66,3,FALSE),\"\")","v":"ΑΕΚ ΤΡΙΠΟΛΗΣ"},null,null,null,null,null,null,null,{"$f":"UPPER(IF($A$2=\"R\",IF(OR(S12=1,S12=\"a\"),R8,IF(OR(S12=2,S12=\"b\"),R16,\"\")),IF(OR(S12=1,S12=\"a\"),R8,IF(OR(S12=2,S12=\"b\"),R16,\"\"))))","v":""}]
[9,{"$f":"VALUE(Setup!E10)","v":12},null,4,0,{"$f":"IF(NOT($G13=\"-\"),VLOOKUP($G13,DrawPrep!$A$3:$F$66,2,FALSE),\"\")","v":0},{"$f":"VLOOKUP($B13,Setup!$K$2:$L$65,2,FALSE)","v":12},{"$f":"IF($G13>0,VLOOKUP($G13,DrawPrep!$A$3:$F$66,6,FALSE),0)","v":12},{"$f":"IF(Setup!$B$24=\"#\",0,IF($G13>0,VLOOKUP($G13,DrawPrep!$A$3:$F$66,3,FALSE),0))","v":60000},{"$f":"IF($I13>0,VLOOKUP($I13,DrawPrep!$C$3:$F$66,2,FALSE),\"bye\")","v":"ΜΟΣΧΟΒΙΝΟΣ ΑΛΕΞΙΟΣ"},"ΜΟΣΧΟΒΙΝΟΣ",{"$f":"IF($I13>0,VLOOKUP($I13,DrawPrep!$C$3:$F$66,3,FALSE),\"\")","v":"Α.Σ. ΑΣΤΕΡΑΣ ΠΕΝΤΕΛΙΚΟΥ"},null,{"$f":"UPPER(IF($A$2=\"R\",IF(OR(M13=1,M13=\"a\"),I13,IF(OR(M13=2,M13=\"b\"),I14,\"\")),IF(OR(M13=1,M13=\"a\"),K13,IF(OR(M13=2,M13=\"b\"),K14,\"\"))))","v":""}]
[10,{"$f":"7-D14+16","v":18},{"$f":"B13","v":12},5,{"$f":"IF($B$2>=C14,1,0)","v":1},{"$f":"IF(NOT($G14=\"-\"),VLOOKUP($G14,DrawPrep!$A$3:$F$66,2,FALSE),\"\")","v":""},{"$f":"IF($B$2>=C14,\"-\",VLOOKUP($B14,Setup!$K$2:$L$65,2,FALSE))","v":"-"},{"$f":"IF(NOT($G14=\"-\"),VLOOKUP($G14,DrawPrep!$A$3:$F$66,6,FALSE),0)","v":0},{"$f":"IF(Setup!$B$24=\"#\",0,IF(NOT($G14=\"-\"),VLOOKUP($G14,DrawPrep!$A$3:$F$66,3,FALSE),0))","v":0},{"$f":"IF($I14>0,VLOOKUP($I14,DrawPrep!$C$3:$F$66,2,FALSE),\"bye\")","v":"bye"},"",{"$f":"IF($I14>0,VLOOKUP($I14,DrawPrep!$C$3:$F$66,3,FALSE),\"\")","v":""},null,null,null,{"$f":"UPPER(IF($A$2=\"R\",IF(OR(O14=1,O14=\"a\"),N13,IF(OR(O14=2,O14=\"b\"),N15,\"\")),IF(OR(O14=1,O14=\"a\"),N13,IF(OR(O14=2,O14=\"b\"),N15,\"\"))))","v":""}]
[11,{"$f":"8-D15+16","v":19},null,5,0,{"$f":"IF(NOT($G15=\"-\"),VLOOKUP($G15,DrawPrep!$A$3:$F$66,2,FALSE),\"\")","v":0},{"$f":"VLOOKUP($B15,Setup!$K$2:$L$65,2,FALSE)","v":21},{"$f":"IF($G15>0,VLOOKUP($G15,DrawPrep!$A$3:$F$66,6,FALSE),0)","v":0},{"$f":"IF(Setup!$B$24=\"#\",0,IF($G15>0,VLOOKUP($G15,DrawPrep!$A$3:$F$66,3,FALSE),0))","v":35560},{"$f":"IF($I15>0,VLOOKUP($I15,DrawPrep!$C$3:$F$66,2,FALSE),\"bye\")","v":"ΔΑΝΙΗΛΟΓΛΟΥ ΓΙΩΡΓΟΣ"},"ΔΑΝΙΗΛΟΓΛΟΥ",{"$f":"IF($I15>0,VLOOKUP($I15,DrawPrep!$C$3:$F$66,3,FALSE),\"\")","v":"Ο.Α. ΓΟΥΔΗ"},null,{"$f":"UPPER(IF($A$2=\"R\",IF(OR(M15=1,M15=\"a\"),I15,IF(OR(M15=2,M15=\"b\"),I16,\"\")),IF(OR(M15=1,M15=\"a\"),K15,IF(OR(M15=2,M15=\"b\"),K16,\"\"))))","v":""}]
{"$rows_left_out":92}
{"sheet":"PrgPrep","index":3,"n_rows":82,"n_cols":7,"rows_kept":82,"cut":false,"hidden":false,"merged":[[0,0,0,5],[1,0,1,5],[74,5,75,5],[2,5,3,5],[37,5,38,5],[67,5,68,5],[56,5,57,5]]}
[{"$f":"Setup!B3 & \", \" & Setup!B4 & \", \" & Setup!B6  & \" (\" & Setup!B7 & \")\"","v":"ΕΦΟΑ, ΠΑΝΕΛΛΑΔΙΚΟ U10, ΑΕΤ ΝΙΚΗ ΠΑΤΡΩΝ (A-A C)"}]
[{"$f":"Setup!$B$10","v":"Στέφος Αλέξης"}]
["Πρόγραμμα αγώνων",null,null,null,"Round 1","i"," Don't change this Worksheet !"]
["ΩΡΑ","Κτγρ.","Αθλητής-Σύλλογος",null,"Αθλητής-Σύλλογος"]
["Έναρξη",{"$f":"Setup!$B$7","v":"A-A C"},{"$f":"IF(OR(Draw!J5=\"bye\",Draw!J5=\"LWD\"), \"\",CONCATENATE(LEFT(Draw!J5,FIND(\" \",Draw!J5)+1),\" (\",Draw!L5,\")\"))","v":"ΙΑΚΩΒΑΚΗΣ Ε (Ο.Α. ΦΟΙΒΟΣ ΛΑΡΙΣΑΣ)"},{"$f":"IF(OR(C5=\"\",E5=\"\"),\" \",\"-\")","v":" "},{"$f":"IF(OR(Draw!J6=\"bye\",Draw!J6=\"LWD\"), \"\",CONCATENATE(LEFT(Draw!J6,FIND(\" \",Draw!J6)+1),\" (\",Draw!L6,\")\"))","v":""}]
[null,{"$f":"Setup!$B$7","v":"A-A C"},{"$f":"IF(OR(Draw!J7=\"bye\",Draw!J7=\"LWD\"), \"\",CONCATENATE(LEFT(Draw!J7,FIND(\" \",Draw!J7)+1),\" (\",Draw!L7,\")\"))","v":"ΤΖΙΤΖΙΜΙΚΑΣ Γ (Α.Ο. ΚΟΛΕΓΙΟΥ ΝΤΕΡΗ)"},{"$f":"IF(OR(C6=\"\",E6=\"\"),\" \",\"-\")","v":" "},{"$f":"IF(OR(Draw!J8=\"bye\",Draw!J8=\"LWD\"), \"\",CONCATENATE(LEFT(Draw!J8,FIND(\" \",Draw!J8)+1),\" (\",Draw!L8,\")\"))","v":""}]
[null,{"$f":"Setup!$B$7","v":"A-A C"},{"$f":"IF(OR(Draw!J9=\"bye\",Draw!J9=\"LWD\"), \"\",CONCATENATE(LEFT(Draw!J9,FIND(\" \",Draw!J9)+1),\" (\",Draw!L9,\")\"))","v":"ΨΑΡΑΚΗΣ Γ (ΚΙΑΤΟ)"}," ",{"$f":"IF(OR(Draw!J10=\"bye\",Draw!J10=\"LWD\"), \"\",CONCATENATE(LEFT(Draw!J10,FIND(\" \",Draw!J10)+1),\" (\",Draw!L10,\")\"))","v":""}]
[null,{"$f":"Setup!$B$7","v":"A-A C"},{"$f":"IF(OR(Draw!J11=\"bye\",Draw!J11=\"LWD\"), \"\",CONCATENATE(LEFT(Draw!J11,FIND(\" \",Draw!J11)+1),\" (\",Draw!L11,\")\"))","v":""}," ",{"$f":"IF(OR(Draw!J12=\"bye\",Draw!J12=\"LWD\"), \"\",CONCATENATE(LEFT(Draw!J12,FIND(\" \",Draw!J12)+1),\" (\",Draw!L12,\")\"))","v":"ΛΑΜΠΡΟΠΟΥΛΟΣ Α (ΑΕΚ ΤΡΙΠΟΛΗΣ)"}]
[null,{"$f":"Setup!$B$7","v":"A-A C"},{"$f":"IF(OR(Draw!J13=\"bye\",Draw!J13=\"LWD\"), \"\",CONCATENATE(LEFT(Draw!J13,FIND(\" \",Draw!J13)+1),\" (\",Draw!L13,\")\"))","v":"ΜΟΣΧΟΒΙΝΟΣ Α (Α.Σ. ΑΣΤΕΡΑΣ ΠΕΝΤΕΛΙΚΟΥ)"}," ",{"$f":"IF(OR(Draw!J14=\"bye\",Draw!J14=\"LWD\"), \"\",CONCATENATE(LEFT(Draw!J14,FIND(\" \",Draw!J14)+1),\" (\",Draw!L14,\")\"))","v":""}]
["όχι πριν",{"$f":"Setup!$B$7","v":"A-A C"},{"$f":"IF(OR(Draw!J15=\"bye\",Draw!J15=\"LWD\"), \"\",CONCATENATE(LEFT(Draw!J15,FIND(\" \",Draw!J15)+1),\" (\",Draw!L15,\")\"))","v":"ΔΑΝΙΗΛΟΓΛΟΥ Γ (Ο.Α. ΓΟΥΔΗ)"}," ",{"$f":"IF(OR(Draw!J16=\"bye\",Draw!J16=\"LWD\"), \"\",CONCATENATE(LEFT(Draw!J16,FIND(\" \",Draw!J16)+1),\" (\",Draw!L16,\")\"))","v":""}]
[null,{"$f":"Setup!$B$7","v":"A-A C"},{"$f":"IF(OR(Draw!J17=\"bye\",Draw!J17=\"LWD\"), \"\",CONCATENATE(LEFT(Draw!J17,FIND(\" \",Draw!J17)+1),\" (\",Draw!L17,\")\"))","v":"ΓΙΑΝΝΑΚΟΠΟΥΛΟΣ Δ (Α. Σ. ΚΟΛΛΕΓΙΟΥ ΝΤΕΡΗ)"}," ",{"$f":"IF(OR(Draw!J18=\"bye\",Draw!J18=\"LWD\"), \"\",CONCATENATE(LEFT(Draw!J18,FIND(\" \",Draw!J18)+1),\" (\",Draw!L18,\")\"))","v":""}]
[null,{"$f":"Setup!$B$7","v":"A-A C"},{"$f":"IF(OR(Draw!J19=\"bye\",Draw!J19=\"LWD\"), \"\",CONCATENATE(LEFT(Draw!J19,FIND(\" \",Draw!J19)+1),\" (\",Draw!L19,\")\"))","v":""}," ",{"$f":"IF(OR(Draw!J20=\"bye\",Draw!J20=\"LWD\"), \"\",CONCATENATE(LEFT(Draw!J20,FIND(\" \",Draw!J20)+1),\" (\",Draw!L20,\")\"))","v":"ΝΙΚΟΛΑΟΥ Α (Α.Ε.Τ. ΝΙΚΗ ΠΑΤΡΩΝ)"}]
[null,{"$f":"Setup!$B$7","v":"A-A C"},{"$f":"IF(OR(Draw!J21=\"bye\",Draw!J21=\"LWD\"), \"\",CONCATENATE(LEFT(Draw!J21,FIND(\" \",Draw!J21)+1),\" (\",Draw!L21,\")\"))","v":"ΛΑΜΠΡΟΠΟΥΛΟΣ Μ (ΑΕΚ ΤΡΙΠΟΛΗΣ)"}," ",{"$f":"IF(OR(Draw!J22=\"bye\",Draw!J22=\"LWD\"), \"\",CONCATENATE(LEFT(Draw!J22,FIND(\" \",Draw!J22)+1),\" (\",Draw!L22,\")\"))","v":""}]
[null,{"$f":"Setup!$B$7","v":"A-A C"},{"$f":"IF(OR(Draw!J23=\"bye\",Draw!J23=\"LWD\"), \"\",CONCATENATE(LEFT(Draw!J23,FIND(\" \",Draw!J23)+1),\" (\",Draw!L23,\")\"))","v":"ΜΕΓΑΛΟΓΙΑΝΝΗΣ Κ (ΑΙΟΛΟΣ ΑΘΛ. ΛΕΣΧΗ ΙΛΙΟΥ)"}," ",{"$f":"IF(OR(Draw!J24=\"bye\",Draw!J24=\"LWD\"), \"\",CONCATENATE(LEFT(Draw!J24,FIND(\" \",Draw!J24)+1),\" (\",Draw!L24,\")\"))","v":""}]
["όχι πριν",{"$f":"Setup!$B$7","v":"A-A C"},{"$f":"IF(OR(Draw!J25=\"bye\",Draw!J25=\"LWD\"), \"\",CONCATENATE(LEFT(Draw!J25,FIND(\" \",Draw!J25)+1),\" (\",Draw!L25,\")\"))","v":"ΜΠΟΝΙΚΟΣ Σ (ΖΑΚΥΝΘΙΝΟΣ Α.Ο.Α.)"}," ",{"$f":"IF(OR(Draw!J26=\"bye\",Draw!J26=\"LWD\"), \"\",CONCATENATE(LEFT(Draw!J26,FIND(\" \",Draw!J26)+1),\" (\",Draw!L26,\")\"))","v":""}]
{"$rows_left_out":68}
{"sheet":"R1","index":4,"n_rows":33,"n_cols":6,"rows_kept":33,"cut":false,"hidden":false,"merged":[[0,0,0,5],[1,0,1,5],[2,5,3,5]]}
["Α' ΕΝΩΣΗ, 2ο Ε3,  (Α12)"]
[0]
["Πρόγραμμα αγώνων",null,null,null,"Round 1","i"]
["ΩΡΑ","Κτγρ.","Αθλητής-Σύλλογος",null,"Αθλητής-Σύλλογος"]
["Έναρξη"]
[]
[]
[]
["όχι πριν"]
[]
[]
[]
["όχι πριν"]
[]
[]
{"$rows_left_out":19}
{"sheet":"R2","index":5,"n_rows":20,"n_cols":6,"rows_kept":20,"cut":false,"hidden":false,"merged":[[0,0,0,5],[1,0,1,5],[2,5,3,5]]}
["Α' ΕΝΩΣΗ, 2ο Ε3,  (Α12)"]
[0]
["Πρόγραμμα αγώνων",null,null,null,"Round 1","i"]
["ΩΡΑ","Κτγρ.","Αθλητής-Σύλλογος",null,"Αθλητής-Σύλλογος"]
["Έναρξη",null,null," ",""]
[null,null,null," ",""]
[null,null,null," ",""]
[null,null,null," ",""]
["όχι πριν",null,null," ",""]
[null,null,null," ",""]
[null,null,null," ",""]
[null,null,null," ",""]
["όχι πριν",null,null," ",""]
[null,null,null," ",""]
[null,null,null," ",""]
{"$rows_left_out":6}
{"sheet":"R3, R4, R5","index":6,"n_rows":44,"n_cols":6,"rows_kept":44,"cut":false,"hidden":false,"merged":[[0,0,0,5],[1,0,1,5],[2,5,3,5],[19,5,20,5],[32,5,33,5]]}
["Α' ΕΝΩΣΗ, 2ο Ε3,  (Α12)"]
[0]
["Πρόγραμμα αγώνων",null,null,null,"Round 3","i"]
["ΩΡΑ","Κτγρ.","Αθλητής-Σύλλογος",null,"Αθλητής-Σύλλογος"]
["Έναρξη","Α12",""," ",""]
[null,"Α12",""," ",""]
[null,"Α12",""," ",""]
[null,"Α12",""," ",""]
["όχι πριν","Α12",""," ",""]
[null,"Α12",""," ",""]
[null,"Α12",""," ",""]
[null,"Α12",""," ",""]
[]
[]
[]
{"$rows_left_out":30}
{"sheet":"notes","index":7,"n_rows":2,"n_cols":1,"rows_kept":2,"cut":false,"hidden":false,"merged":[]}
["Α' ΕΝΩΣΗ, 2ο Ε3,  (Α12)"]
[0]

{"sheet":"tmp","index":8,"n_rows":65,"n_cols":24,"rows_kept":65,"cut":false,"hidden":false,"merged":[[31,9,33,9],[31,16,33,16],[20,8,22,8],[20,16,22,16],[25,9,25,22],[26,9,26,10],[26,16,26,17],[27,9,30,9],[27,16,30,16],[11,8,11,23],[12,16,12,17],[13,8,16,8],[13,16,16,16],[17,8,19,8],[17,16,19,16],[0,8,0,23],[1,16,1,17],[2,8,5,8],[2,16,5,16],[6,8,8,8],[6,16,8,16]]}
["RndIndx","random","FixRandom",null,"α/α","seed","bye",null,"ΠΡΟΚΡΙΜΑΤΙΚΑ E1, E2 (32 για 8)"]
[1,{"$f":"RAND()/222","v":1.2431115246962019E-3},5.2569749377454989E-4,null,1,1,null,null,null,null,"17-32","9-16","5-8","3-4","2ος","1ος",null,null,"17-32","9-16","5-8","3-4","2ος","1ος"]
[2,2.0504080265433878E-3,3.716204021374256E-3,null,2,null,1,null,"E1","E1-12",1,2,2,0,0,0,"E1","E1-12",1,1,0,0,0,0]
[3,1.0486332491904001E-3,7.4189261991627474E-4,null,3,null,null,null,null,"E1-14",3,4,4,0,0,0,null,"E1-14",3,1,0,0,0,0]
[4,1.1367215909047382E-3,3.1258977041393348E-3,null,4,null,29,null,null,"E1-16",6,8,8,0,0,0,null,"E1-16",6,2,0,0,0,0]
[5,{"$f":"RAND()/222","v":2.044971364682421E-3},3.5037585997559169E-3,null,5,null,null,null,null,"E1-18",7.5,10,10,null,null,null,null,"E1-18",7.5,2.5,0,0,0,0]
[6,{"$f":"RAND()/222","v":1.8367670505979182E-3},3.1462746246709652E-3,null,6,null,17,null,"E2","E2-12",0.3,0.5,0.5,0,0,0,"E2","E2-12",0.3,0.2,0,0,0,0]
[7,{"$f":"RAND()/222","v":3.6202967091819851E-3},3.6807878020697861E-3,null,7,null,13,null,null,"E2-14",1,2,2,0,0,0,null,"E2-14",1,1,0,0,0,0]
[8,3.1416679116334275E-3,2.2311311084535052E-3,null,8,13,null,null,null,"E2-16",2,4,4,0,0,0,null,"E2-16",2,2,0,0,0,0]
[9,1.3255126272550858E-3,1.0242326640316163E-3,null,9,11]
[10,9.7595238876103355E-4,4.3885891256489912E-3,null,10,null,9]
[11,3.9896570144729035E-3,3.4037156641968259E-3,null,11,null,null,null,"ΚΥΡΙΩΣ ΤΑΜΠΛΟ E1, E2 & E3"]
[12,1.76549859223111E-3,3.9029554214002051E-4,null,12,null,25,null,null,null,"17-32","9-16","5-8","3-4","2ος","1ος",null,null,"17-32","9-16","5-8","3-4","2ος","1ος"]
[13,3.9308731420871316E-3,3.8677240688477161E-3,null,13,null,null,null,"E1","E1-12",7,10,14,21,35,42,"E1","E1-12",7,3,4,7,14,7]
[14,2.9668281944028327E-3,2.235346199736784E-3,null,14,null,21,null,null,"E1-14",10,15,20,30,50,60,null,"E1-14",10,5,5,10,20,10]
{"$rows_left_out":51}
{"sheet":"tmpRankings","index":9,"n_rows":2,"n_cols":7,"rows_kept":2,"cut":false,"hidden":false,"merged":[]}
["ΑΜ","Ονοματεπώνυμο","Γεν.","Σύλλογος","Βαθμ"]
[null,null,null,null,null,null,"=VLOOKUP(c3;tmpRankings!$A$2:$E$251;5;FALSE)"]